OCamllabs icon Home|Differences with the last checks|Previous runs


Building on spring

(from freebsd)
2024-07-02 21:39.05 ---> using "77d5fe31836124b4684d554707425c4fde23f9ef3df0a804431a47419573778d" from cache

/: (user (uid 1000) (gid 1000))

/: (env OPAMPRECISETRACKING 1)

/: (env OPAMUTF8 never)

/: (env OPAMEXTERNALSOLVER builtin-0install)

/: (env OPAMCRITERIA +removed)

/: (run (shell "sudo ln -f /usr/local/bin/opam-dev /usr/local/bin/opam"))
2024-07-02 21:39.05 ---> using "a2b22593046b56fadc85e22b0da7b84e903c1f5aa4d42a7c481121ceec28b31f" from cache

/: (run (network host)
        (shell "rm -rf ~/opam-repository && git clone -q 'https://github.com/ocaml/opam-repository' ~/opam-repository && git -C ~/opam-repository checkout -q 175a8ca8b27d9a46ed86ec5d7b1130c98a153055"))
2024-07-02 21:39.05 ---> using "12d681098b105578a67465aa7bc396c5d90e9ce4e3304a8d75f23641353fa26c" from cache

/: (run (shell "rm -rf ~/.opam && opam init -ya --bare ~/opam-repository"))
No configuration file found, using built-in defaults.
Checking for available remotes: rsync and local, git.
  - you won't be able to use mercurial repositories unless you install the hg command on your system.
  - you won't be able to use darcs repositories unless you install the darcs command on your system.


<><> Fetching repository information ><><><><><><><><><><><><><><><><><><><><><>
[default] Initialised

User configuration:
  ~/.profile is already up-to-date.
[NOTE] Make sure that ~/.profile is well sourced in your ~/.bashrc.

2024-07-02 21:39.06 ---> using "cd58f29b8c142c1ae36c06cbe6d040fc45053855e85f74d3d710bce30c463662" from cache

/: (run (cache (opam-archives (target /home/opam/.opam/download-cache)))
        (network host)
        (shell "opam switch create --repositories=default '4.14.1' 'ocaml-base-compiler.4.14.1'"))

<><> Installing new switch packages <><><><><><><><><><><><><><><><><><><><><><>
Switch invariant: ["ocaml-base-compiler" {= "4.14.1"}]

<><> Processing actions <><><><><><><><><><><><><><><><><><><><><><><><><><><><>
-> retrieved ocaml-config.2  (cached)
-> installed base-bigarray.base
-> installed base-threads.base
-> installed base-unix.base
-> installed host-arch-x86_64.1
-> installed host-system-other.1
-> installed ocaml-options-vanilla.1
-> retrieved ocaml-base-compiler.4.14.1  (cached)
-> installed ocaml-base-compiler.4.14.1
-> installed ocaml-config.2
-> installed ocaml.4.14.1
Done.
# Run eval $(opam env --switch=4.14.1) to update the current shell environment
2024-07-02 21:39.06 ---> using "7b308b2584dc258233cfb37ad83354a0804ec90976555e191659bff7e597c170" from cache

/: (run (network host)
        (shell "opam update --depexts"))
[WARNING] Unknown update command for bsd, skipping system update
2024-07-02 21:39.07 ---> using "3f0c14f5761a225622a6acf1a058a90ab52281bdd9172d3eca06be38cd0468ad" from cache

/: (run (cache (opam-archives (target /home/opam/.opam/download-cache)))
        (network host)
        (shell  "\
               \nopam remove -y \"core_profiler.v0.14.0\"\
               \nopam install -vy \"core_profiler.v0.14.0\"\
               \nres=$?\
               \nif [ $res = 31 ]; then\
               \n    if opam show -f x-ci-accept-failures: \"core_profiler.v0.14.0\" | grep -q '\"freebsd\"'; then\
               \n        echo \"This package failed and has been disabled for CI using the 'x-ci-accept-failures' field.\"\
               \n        exit 69\
               \n    fi\
               \nfi\
               \n\
               \n\
               \nexit $res\
               \n"))
[NOTE] core_profiler.v0.14.0 is not installed.

Nothing to do.
The following actions will be performed:
=== install 64 packages
  - install base                v0.14.3 [required by core_kernel]
  - install base_bigstring      v0.14.0 [required by core_kernel]
  - install base_quickcheck     v0.14.1 [required by core_kernel]
  - install bin_prot            v0.14.1 [required by core_kernel]
  - install conf-g++            1.0     [required by re2]
  - install core                v0.14.1 [required by core_profiler]
  - install core_kernel         v0.14.2 [required by core_profiler]
  - install core_profiler       v0.14.0
  - install csexp               1.5.2   [required by dune-configurator]
  - install dune                3.16.0  [required by core_profiler]
  - install dune-configurator   3.16.0  [required by base]
  - install fieldslib           v0.14.0 [required by core_kernel]
  - install jane-street-headers v0.14.0 [required by core_kernel]
  - install jst-config          v0.14.1 [required by core, shell]
  - install num                 1.5     [required by sexplib]
  - install ocaml-compiler-libs v0.12.4 [required by ppxlib]
  - install octavius            1.2.2   [required by ppx_js_style]
  - install parsexp             v0.14.2 [required by sexplib]
  - install ppx_assert          v0.14.0 [required by core_kernel]
  - install ppx_base            v0.14.0 [required by core_kernel]
  - install ppx_bench           v0.14.1 [required by ppx_jane]
  - install ppx_bin_prot        v0.14.0 [required by ppx_jane]
  - install ppx_cold            v0.14.0 [required by ppx_base]
  - install ppx_compare         v0.14.0 [required by ppx_base, bin_prot]
  - install ppx_custom_printf   v0.14.1 [required by ppx_jane]
  - install ppx_derivers        1.2.1   [required by ppxlib]
  - install ppx_enumerate       v0.14.0 [required by ppx_base]
  - install ppx_expect          v0.14.2 [required by ppx_jane]
  - install ppx_fields_conv     v0.14.2 [required by ppx_jane]
  - install ppx_fixed_literal   v0.14.0 [required by ppx_jane]
  - install ppx_hash            v0.14.0 [required by core_kernel]
  - install ppx_here            v0.14.0 [required by ppx_jane]
  - install ppx_inline_test     v0.14.1 [required by core_kernel]
  - install ppx_jane            v0.14.0 [required by core_profiler]
  - install ppx_js_style        v0.14.1 [required by ppx_base]
  - install ppx_let             v0.14.0 [required by ppx_jane]
  - install ppx_module_timer    v0.14.0 [required by ppx_jane]
  - install ppx_optcomp         v0.14.3 [required by core_kernel]
  - install ppx_optional        v0.14.0 [required by ppx_jane]
  - install ppx_pipebang        v0.14.0 [required by ppx_jane]
  - install ppx_sexp_conv       v0.14.3 [required by core_kernel]
  - install ppx_sexp_message    v0.14.1 [required by core_kernel]
  - install ppx_sexp_value      v0.14.0 [required by ppx_jane]
  - install ppx_stable          v0.14.1 [required by ppx_jane]
  - install ppx_string          v0.14.1 [required by ppx_jane]
  - install ppx_typerep_conv    v0.14.2 [required by ppx_jane]
  - install ppx_variants_conv   v0.14.2 [required by ppx_jane]
  - install ppxlib              0.25.1  [required by ppx_jane]
  - install re                  1.11.0  [required by ppx_expect]
  - install re2                 v0.14.0 [required by core_profiler]
  - install seq                 base    [required by re]
  - install sexplib             v0.14.0 [required by core]
  - install sexplib0            v0.14.0 [required by base, sexplib]
  - install shell               v0.14.0 [required by core_profiler]
  - install spawn               v0.15.1 [required by core, shell]
  - install splittable_random   v0.14.0 [required by core_kernel]
  - install stdio               v0.14.0 [required by core_kernel]
  - install stdlib-shims        0.3.0   [required by ppxlib]
  - install textutils           v0.14.0 [required by core_profiler]
  - install textutils_kernel    v0.14.0 [required by core_profiler]
  - install time_now            v0.14.0 [required by core_kernel]
  - install timezone            v0.14.0 [required by core]
  - install typerep             v0.14.0 [required by core_kernel]
  - install variantslib         v0.14.0 [required by core_kernel]

The following system packages will first need to be installed:
    gcc

<><> Handling external dependencies <><><><><><><><><><><><><><><><><><><><><><>

opam believes some required external dependencies are missing. opam can:
> 1. Run pkg to install them (may need root/sudo access)
  2. Display the recommended pkg command and wait while you run it manually (e.g. in another terminal)
  3. Continue anyway, and, upon success, permanently register that this external dependency is present, but not detectable
  4. Abort the installation

[1/2/3/4] 1

+ /usr/local/bin/sudo "pkg" "install" "-y" "gcc"
- Updating FreeBSD repository catalogue...
- [spring] Fetching data.pkg: ...
- ....... done
- Processing entries: 
- .
- .
- .
- .
- .
- .
- .
- .
- .
- . done
- FreeBSD repository update completed. 34081 packages processed.
- All repositories are up to date.
- The following 6 package(s) will be affected (of 0 checked):
- 
- New packages to be INSTALLED:
- 	binutils: 2.40_5,1
- 	gcc: 13_5
- 	gcc13: 13.2.0_4
- 	gmp: 6.3.0
- 	mpc: 1.3.1_1
- 	mpfr: 4.2.1,1
- 
- Number of packages to be installed: 6
- 
- The process will require 449 MiB more space.
- 99 MiB to be downloaded.
- [spring] [1/6] Fetching mpc-1.3.1_1.pkg: .......... done
- [spring] [2/6] Fetching gcc-13_5.pkg: . done
- [spring] [3/6] Fetching gcc13-13.2.0_4.pkg: 
- .
- .
- ..
- .
- .
- ..
- .
- . done
- [spring] [4/6] Fetching mpfr-4.2.1,1.pkg: .......... done
- [spring] [5/6] Fetching gmp-6.3.0.pkg: .......... done
- [spring] [6/6] Fetching binutils-2.40_5,1.pkg: 
- ....
- .....
- . done
- Checking integrity... done (0 conflicting)
- [spring] [1/6] Installing gmp-6.3.0...
- [spring] [1/6] Extracting gmp-6.3.0: .......... done
- [spring] [2/6] Installing mpfr-4.2.1,1...
- [spring] [2/6] Extracting mpfr-4.2.1,1: .......... done
- [spring] [3/6] Installing mpc-1.3.1_1...
- [spring] [3/6] Extracting mpc-1.3.1_1: ......... done
- [spring] [4/6] Installing binutils-2.40_5,1...
- [spring] [4/6] Extracting binutils-2.40_5,1: 
- ......
- .... done
- [spring] [5/6] Installing gcc13-13.2.0_4...
- [spring] [5/6] Extracting gcc13-13.2.0_4: ......
- ...
- . done
- [spring] [6/6] Installing gcc-13_5...
- [spring] [6/6] Extracting gcc-13_5: ... done
- =====
- Message from gcc13-13.2.0_4:
- 
- --
- To ensure binaries built with this toolchain find appropriate versions
- of the necessary run-time libraries, you may want to link using
- 
-   -Wl,-rpath=/usr/local/lib/gcc13
- 
- For ports leveraging USE_GCC, USES=compiler, or USES=fortran this happens
- transparently.

<><> Processing actions <><><><><><><><><><><><><><><><><><><><><><><><><><><><>
Processing  1/191: [base.v0.14.3: extract]
Processing  2/191: [base.v0.14.3: extract] [base_bigstring.v0.14.0: extract]
Processing  3/191: [base.v0.14.3: extract] [base_bigstring.v0.14.0: extract] [base_quickcheck.v0.14.1: extract]
-> retrieved base_bigstring.v0.14.0  (cached)
Processing  3/191: [base.v0.14.3: extract] [base_quickcheck.v0.14.1: extract]
Processing  4/191: [base.v0.14.3: extract] [base_quickcheck.v0.14.1: extract] [bin_prot.v0.14.1: extract]
-> retrieved base_quickcheck.v0.14.1  (cached)
Processing  4/191: [base.v0.14.3: extract] [bin_prot.v0.14.1: extract]
Processing  5/191: [base.v0.14.3: extract] [bin_prot.v0.14.1: extract]
Processing  6/191: [base.v0.14.3: extract] [bin_prot.v0.14.1: extract] [core.v0.14.1: extract]
Processing  7/191: [base.v0.14.3: extract] [bin_prot.v0.14.1: extract] [core.v0.14.1: extract] [conf-g++: g++]
-> retrieved bin_prot.v0.14.1  (cached)
Processing  7/191: [base.v0.14.3: extract] [core.v0.14.1: extract] [conf-g++: g++]
Processing  8/191: [base.v0.14.3: extract] [core.v0.14.1: extract] [core_kernel.v0.14.2: extract] [conf-g++: g++]
+ /usr/local/bin/g++ "--version" (CWD=/home/opam/.opam/4.14.1/.opam-switch/build/conf-g++.1.0)
- g++ (FreeBSD Ports Collection) 13.2.0
- Copyright (C) 2023 Free Software Foundation, Inc.
- This is free software; see the source for copying conditions.  There is NO
- warranty; not even for MERCHANTABILITY or FITNESS FOR A PARTICULAR PURPOSE.
- 
-> compiled  conf-g++.1.0
Processing  8/191: [base.v0.14.3: extract] [core.v0.14.1: extract] [core_kernel.v0.14.2: extract]
-> installed conf-g++.1.0
Processing  9/191: [base.v0.14.3: extract] [core.v0.14.1: extract] [core_kernel.v0.14.2: extract]
-> retrieved core.v0.14.1  (cached)
Processing  9/191: [base.v0.14.3: extract] [core_kernel.v0.14.2: extract]
Processing 10/191: [base.v0.14.3: extract] [core_kernel.v0.14.2: extract] [core_profiler.v0.14.0: http]
-> retrieved core_kernel.v0.14.2  (cached)
Processing 10/191: [base.v0.14.3: extract] [core_profiler.v0.14.0: http]
Processing 11/191: [base.v0.14.3: extract] [core_profiler.v0.14.0: http] [csexp.1.5.2: extract]
-> retrieved base.v0.14.3  (cached)
Processing 11/191: [core_profiler.v0.14.0: http] [csexp.1.5.2: extract]
Processing 12/191: [core_profiler.v0.14.0: http] [csexp.1.5.2: extract] [dune.3.16.0, dune-configurator.3.16.0: extract]
-> retrieved csexp.1.5.2  (cached)
Processing 12/191: [core_profiler.v0.14.0: http] [dune.3.16.0, dune-configurator.3.16.0: extract]
Processing 13/191: [core_profiler.v0.14.0: http] [dune.3.16.0, dune-configurator.3.16.0: extract] [fieldslib.v0.14.0: extract]
-> retrieved fieldslib.v0.14.0  (cached)
Processing 13/191: [core_profiler.v0.14.0: http] [dune.3.16.0, dune-configurator.3.16.0: extract]
Processing 14/191: [core_profiler.v0.14.0: http] [dune.3.16.0, dune-configurator.3.16.0: extract] [jane-street-headers.v0.14.0: extract]
Processing 14/191: [core_profiler.v0.14.0: extract] [dune.3.16.0, dune-configurator.3.16.0: extract] [jane-street-headers.v0.14.0: extract]
-> retrieved jane-street-headers.v0.14.0  (cached)
Processing 14/191: [core_profiler.v0.14.0: extract] [dune.3.16.0, dune-configurator.3.16.0: extract]
Processing 15/191: [core_profiler.v0.14.0: extract] [dune.3.16.0, dune-configurator.3.16.0: extract] [jst-config.v0.14.1: extract]
-> retrieved core_profiler.v0.14.0  (https://ocaml.janestreet.com/ocaml-core/v0.14/files/core_profiler-v0.14.0.tar.gz)
Processing 15/191: [dune.3.16.0, dune-configurator.3.16.0: extract] [jst-config.v0.14.1: extract]
Processing 16/191: [dune.3.16.0, dune-configurator.3.16.0: extract] [jst-config.v0.14.1: extract] [num.1.5: extract]
-> retrieved jst-config.v0.14.1  (cached)
Processing 16/191: [dune.3.16.0, dune-configurator.3.16.0: extract] [num.1.5: extract]
Processing 17/191: [dune.3.16.0, dune-configurator.3.16.0: extract] [num.1.5: extract] [ocaml-compiler-libs.v0.12.4: extract]
-> retrieved num.1.5  (cached)
Processing 17/191: [dune.3.16.0, dune-configurator.3.16.0: extract] [ocaml-compiler-libs.v0.12.4: extract]
Processing 18/191: [dune.3.16.0, dune-configurator.3.16.0: extract] [ocaml-compiler-libs.v0.12.4: extract] [octavius.1.2.2: extract]
Processing 19/191: [dune.3.16.0, dune-configurator.3.16.0: extract] [ocaml-compiler-libs.v0.12.4: extract] [octavius.1.2.2: extract] [num: gmake opam-legacy]
-> retrieved octavius.1.2.2  (cached)
Processing 19/191: [dune.3.16.0, dune-configurator.3.16.0: extract] [ocaml-compiler-libs.v0.12.4: extract] [num: gmake opam-legacy]
Processing 20/191: [dune.3.16.0, dune-configurator.3.16.0: extract] [ocaml-compiler-libs.v0.12.4: extract] [parsexp.v0.14.2: extract] [num: gmake opam-legacy]
-> retrieved ocaml-compiler-libs.v0.12.4  (cached)
Processing 20/191: [dune.3.16.0, dune-configurator.3.16.0: extract] [parsexp.v0.14.2: extract] [num: gmake opam-legacy]
Processing 21/191: [dune.3.16.0, dune-configurator.3.16.0: extract] [parsexp.v0.14.2: extract] [ppx_assert.v0.14.0: extract] [num: gmake opam-legacy]
-> retrieved parsexp.v0.14.2  (cached)
Processing 21/191: [dune.3.16.0, dune-configurator.3.16.0: extract] [ppx_assert.v0.14.0: extract] [num: gmake opam-legacy]
Processing 22/191: [dune.3.16.0, dune-configurator.3.16.0: extract] [ppx_assert.v0.14.0: extract] [ppx_base.v0.14.0: extract] [num: gmake opam-legacy]
-> retrieved ppx_assert.v0.14.0  (cached)
Processing 22/191: [dune.3.16.0, dune-configurator.3.16.0: extract] [ppx_base.v0.14.0: extract] [num: gmake opam-legacy]
Processing 23/191: [dune.3.16.0, dune-configurator.3.16.0: extract] [ppx_base.v0.14.0: extract] [ppx_bench.v0.14.1: extract] [num: gmake opam-legacy]
-> retrieved ppx_base.v0.14.0  (cached)
Processing 23/191: [dune.3.16.0, dune-configurator.3.16.0: extract] [ppx_bench.v0.14.1: extract] [num: gmake opam-legacy]
Processing 24/191: [dune.3.16.0, dune-configurator.3.16.0: extract] [ppx_bench.v0.14.1: extract] [ppx_bin_prot.v0.14.0: extract] [num: gmake opam-legacy]
-> retrieved ppx_bench.v0.14.1  (cached)
Processing 24/191: [dune.3.16.0, dune-configurator.3.16.0: extract] [ppx_bin_prot.v0.14.0: extract] [num: gmake opam-legacy]
Processing 25/191: [dune.3.16.0, dune-configurator.3.16.0: extract] [ppx_bin_prot.v0.14.0: extract] [ppx_cold.v0.14.0: extract] [num: gmake opam-legacy]
-> retrieved ppx_bin_prot.v0.14.0  (cached)
Processing 25/191: [dune.3.16.0, dune-configurator.3.16.0: extract] [ppx_cold.v0.14.0: extract] [num: gmake opam-legacy]
Processing 26/191: [dune.3.16.0, dune-configurator.3.16.0: extract] [ppx_cold.v0.14.0: extract] [ppx_compare.v0.14.0: extract] [num: gmake opam-legacy]
-> retrieved ppx_cold.v0.14.0  (cached)
Processing 26/191: [dune.3.16.0, dune-configurator.3.16.0: extract] [ppx_compare.v0.14.0: extract] [num: gmake opam-legacy]
Processing 27/191: [dune.3.16.0, dune-configurator.3.16.0: extract] [ppx_compare.v0.14.0: extract] [ppx_custom_printf.v0.14.1: extract] [num: gmake opam-legacy]
-> retrieved ppx_compare.v0.14.0  (cached)
Processing 27/191: [dune.3.16.0, dune-configurator.3.16.0: extract] [ppx_custom_printf.v0.14.1: extract] [num: gmake opam-legacy]
Processing 28/191: [dune.3.16.0, dune-configurator.3.16.0: extract] [ppx_custom_printf.v0.14.1: extract] [ppx_derivers.1.2.1: extract] [num: gmake opam-legacy]
-> retrieved ppx_derivers.1.2.1  (cached)
Processing 28/191: [dune.3.16.0, dune-configurator.3.16.0: extract] [ppx_custom_printf.v0.14.1: extract] [num: gmake opam-legacy]
Processing 29/191: [dune.3.16.0, dune-configurator.3.16.0: extract] [ppx_custom_printf.v0.14.1: extract] [ppx_enumerate.v0.14.0: extract] [num: gmake opam-legacy]
-> retrieved ppx_custom_printf.v0.14.1  (cached)
Processing 29/191: [dune.3.16.0, dune-configurator.3.16.0: extract] [ppx_enumerate.v0.14.0: extract] [num: gmake opam-legacy]
Processing 30/191: [dune.3.16.0, dune-configurator.3.16.0: extract] [ppx_enumerate.v0.14.0: extract] [ppx_expect.v0.14.2: extract] [num: gmake opam-legacy]
-> retrieved ppx_enumerate.v0.14.0  (cached)
Processing 30/191: [dune.3.16.0, dune-configurator.3.16.0: extract] [ppx_expect.v0.14.2: extract] [num: gmake opam-legacy]
Processing 31/191: [dune.3.16.0, dune-configurator.3.16.0: extract] [ppx_expect.v0.14.2: extract] [ppx_fields_conv.v0.14.2: extract] [num: gmake opam-legacy]
-> retrieved ppx_fields_conv.v0.14.2  (cached)
Processing 31/191: [dune.3.16.0, dune-configurator.3.16.0: extract] [ppx_expect.v0.14.2: extract] [num: gmake opam-legacy]
Processing 32/191: [dune.3.16.0, dune-configurator.3.16.0: extract] [ppx_expect.v0.14.2: extract] [ppx_fixed_literal.v0.14.0: extract] [num: gmake opam-legacy]
-> retrieved ppx_expect.v0.14.2  (cached)
Processing 32/191: [dune.3.16.0, dune-configurator.3.16.0: extract] [ppx_fixed_literal.v0.14.0: extract] [num: gmake opam-legacy]
Processing 33/191: [dune.3.16.0, dune-configurator.3.16.0: extract] [ppx_fixed_literal.v0.14.0: extract] [ppx_hash.v0.14.0: extract] [num: gmake opam-legacy]
-> retrieved ppx_fixed_literal.v0.14.0  (cached)
Processing 33/191: [dune.3.16.0, dune-configurator.3.16.0: extract] [ppx_hash.v0.14.0: extract] [num: gmake opam-legacy]
Processing 34/191: [dune.3.16.0, dune-configurator.3.16.0: extract] [ppx_hash.v0.14.0: extract] [ppx_here.v0.14.0: extract] [num: gmake opam-legacy]
-> retrieved ppx_hash.v0.14.0  (cached)
Processing 34/191: [dune.3.16.0, dune-configurator.3.16.0: extract] [ppx_here.v0.14.0: extract] [num: gmake opam-legacy]
Processing 35/191: [dune.3.16.0, dune-configurator.3.16.0: extract] [ppx_here.v0.14.0: extract] [ppx_inline_test.v0.14.1: extract] [num: gmake opam-legacy]
-> retrieved ppx_here.v0.14.0  (cached)
Processing 35/191: [dune.3.16.0, dune-configurator.3.16.0: extract] [ppx_inline_test.v0.14.1: extract] [num: gmake opam-legacy]
Processing 36/191: [dune.3.16.0, dune-configurator.3.16.0: extract] [ppx_inline_test.v0.14.1: extract] [ppx_jane.v0.14.0: extract] [num: gmake opam-legacy]
-> retrieved ppx_inline_test.v0.14.1  (cached)
Processing 36/191: [dune.3.16.0, dune-configurator.3.16.0: extract] [ppx_jane.v0.14.0: extract] [num: gmake opam-legacy]
Processing 37/191: [dune.3.16.0, dune-configurator.3.16.0: extract] [ppx_jane.v0.14.0: extract] [ppx_js_style.v0.14.1: extract] [num: gmake opam-legacy]
-> retrieved ppx_jane.v0.14.0  (cached)
Processing 37/191: [dune.3.16.0, dune-configurator.3.16.0: extract] [ppx_js_style.v0.14.1: extract] [num: gmake opam-legacy]
Processing 38/191: [dune.3.16.0, dune-configurator.3.16.0: extract] [ppx_js_style.v0.14.1: extract] [ppx_let.v0.14.0: extract] [num: gmake opam-legacy]
-> retrieved ppx_js_style.v0.14.1  (cached)
Processing 38/191: [dune.3.16.0, dune-configurator.3.16.0: extract] [ppx_let.v0.14.0: extract] [num: gmake opam-legacy]
Processing 39/191: [dune.3.16.0, dune-configurator.3.16.0: extract] [ppx_let.v0.14.0: extract] [ppx_module_timer.v0.14.0: extract] [num: gmake opam-legacy]
-> retrieved ppx_let.v0.14.0  (cached)
Processing 39/191: [dune.3.16.0, dune-configurator.3.16.0: extract] [ppx_module_timer.v0.14.0: extract] [num: gmake opam-legacy]
Processing 40/191: [dune.3.16.0, dune-configurator.3.16.0: extract] [ppx_module_timer.v0.14.0: extract] [ppx_optcomp.v0.14.3: extract] [num: gmake opam-legacy]
-> retrieved ppx_module_timer.v0.14.0  (cached)
Processing 40/191: [dune.3.16.0, dune-configurator.3.16.0: extract] [ppx_optcomp.v0.14.3: extract] [num: gmake opam-legacy]
Processing 41/191: [dune.3.16.0, dune-configurator.3.16.0: extract] [ppx_optcomp.v0.14.3: extract] [ppx_optional.v0.14.0: extract] [num: gmake opam-legacy]
-> retrieved ppx_optcomp.v0.14.3  (cached)
Processing 41/191: [dune.3.16.0, dune-configurator.3.16.0: extract] [ppx_optional.v0.14.0: extract] [num: gmake opam-legacy]
Processing 42/191: [dune.3.16.0, dune-configurator.3.16.0: extract] [ppx_optional.v0.14.0: extract] [ppx_pipebang.v0.14.0: extract] [num: gmake opam-legacy]
-> retrieved ppx_optional.v0.14.0  (cached)
Processing 42/191: [dune.3.16.0, dune-configurator.3.16.0: extract] [ppx_pipebang.v0.14.0: extract] [num: gmake opam-legacy]
Processing 43/191: [dune.3.16.0, dune-configurator.3.16.0: extract] [ppx_pipebang.v0.14.0: extract] [ppx_sexp_conv.v0.14.3: extract] [num: gmake opam-legacy]
-> retrieved ppx_pipebang.v0.14.0  (cached)
Processing 43/191: [dune.3.16.0, dune-configurator.3.16.0: extract] [ppx_sexp_conv.v0.14.3: extract] [num: gmake opam-legacy]
Processing 44/191: [dune.3.16.0, dune-configurator.3.16.0: extract] [ppx_sexp_conv.v0.14.3: extract] [ppx_sexp_message.v0.14.1: extract] [num: gmake opam-legacy]
-> retrieved ppx_sexp_conv.v0.14.3  (cached)
Processing 44/191: [dune.3.16.0, dune-configurator.3.16.0: extract] [ppx_sexp_message.v0.14.1: extract] [num: gmake opam-legacy]
Processing 45/191: [dune.3.16.0, dune-configurator.3.16.0: extract] [ppx_sexp_message.v0.14.1: extract] [ppx_sexp_value.v0.14.0: extract] [num: gmake opam-legacy]
-> retrieved ppx_sexp_message.v0.14.1  (cached)
Processing 45/191: [dune.3.16.0, dune-configurator.3.16.0: extract] [ppx_sexp_value.v0.14.0: extract] [num: gmake opam-legacy]
Processing 46/191: [dune.3.16.0, dune-configurator.3.16.0: extract] [ppx_sexp_value.v0.14.0: extract] [ppx_stable.v0.14.1: extract] [num: gmake opam-legacy]
-> retrieved ppx_sexp_value.v0.14.0  (cached)
Processing 46/191: [dune.3.16.0, dune-configurator.3.16.0: extract] [ppx_stable.v0.14.1: extract] [num: gmake opam-legacy]
Processing 47/191: [dune.3.16.0, dune-configurator.3.16.0: extract] [ppx_stable.v0.14.1: extract] [ppx_string.v0.14.1: extract] [num: gmake opam-legacy]
-> retrieved ppx_stable.v0.14.1  (cached)
Processing 47/191: [dune.3.16.0, dune-configurator.3.16.0: extract] [ppx_string.v0.14.1: extract] [num: gmake opam-legacy]
Processing 48/191: [dune.3.16.0, dune-configurator.3.16.0: extract] [ppx_string.v0.14.1: extract] [ppx_typerep_conv.v0.14.2: extract] [num: gmake opam-legacy]
-> retrieved ppx_string.v0.14.1  (cached)
Processing 48/191: [dune.3.16.0, dune-configurator.3.16.0: extract] [ppx_typerep_conv.v0.14.2: extract] [num: gmake opam-legacy]
Processing 49/191: [dune.3.16.0, dune-configurator.3.16.0: extract] [ppx_typerep_conv.v0.14.2: extract] [ppx_variants_conv.v0.14.2: extract] [num: gmake opam-legacy]
-> retrieved ppx_typerep_conv.v0.14.2  (cached)
Processing 49/191: [dune.3.16.0, dune-configurator.3.16.0: extract] [ppx_variants_conv.v0.14.2: extract] [num: gmake opam-legacy]
Processing 50/191: [dune.3.16.0, dune-configurator.3.16.0: extract] [ppx_variants_conv.v0.14.2: extract] [ppxlib.0.25.1: extract] [num: gmake opam-legacy]
-> retrieved ppx_variants_conv.v0.14.2  (cached)
Processing 50/191: [dune.3.16.0, dune-configurator.3.16.0: extract] [ppxlib.0.25.1: extract] [num: gmake opam-legacy]
Processing 51/191: [dune.3.16.0, dune-configurator.3.16.0: extract] [ppxlib.0.25.1: extract] [re.1.11.0: extract] [num: gmake opam-legacy]
-> retrieved re.1.11.0  (cached)
Processing 51/191: [dune.3.16.0, dune-configurator.3.16.0: extract] [ppxlib.0.25.1: extract] [num: gmake opam-legacy]
Processing 52/191: [dune.3.16.0, dune-configurator.3.16.0: extract] [ppxlib.0.25.1: extract] [re2.v0.14.0: http] [num: gmake opam-legacy]
-> retrieved ppxlib.0.25.1  (cached)
Processing 52/191: [dune.3.16.0, dune-configurator.3.16.0: extract] [re2.v0.14.0: http] [num: gmake opam-legacy]
-> retrieved seq.base  (cached)
Processing 53/191: [dune.3.16.0, dune-configurator.3.16.0: extract] [re2.v0.14.0: http] [num: gmake opam-legacy]
Processing 54/191: [dune.3.16.0, dune-configurator.3.16.0: extract] [re2.v0.14.0: http] [sexplib.v0.14.0: extract] [num: gmake opam-legacy]
Processing 55/191: [dune.3.16.0, dune-configurator.3.16.0: extract] [re2.v0.14.0: http] [sexplib.v0.14.0: extract] [num: gmake opam-legacy]
-> installed seq.base
Processing 56/191: [dune.3.16.0, dune-configurator.3.16.0: extract] [re2.v0.14.0: http] [sexplib.v0.14.0: extract] [num: gmake opam-legacy]
-> retrieved sexplib.v0.14.0  (cached)
Processing 56/191: [dune.3.16.0, dune-configurator.3.16.0: extract] [re2.v0.14.0: http] [num: gmake opam-legacy]
Processing 57/191: [dune.3.16.0, dune-configurator.3.16.0: extract] [re2.v0.14.0: http] [sexplib0.v0.14.0: extract] [num: gmake opam-legacy]
-> retrieved sexplib0.v0.14.0  (cached)
Processing 57/191: [dune.3.16.0, dune-configurator.3.16.0: extract] [re2.v0.14.0: http] [num: gmake opam-legacy]
Processing 58/191: [dune.3.16.0, dune-configurator.3.16.0: extract] [re2.v0.14.0: http] [shell.v0.14.0: http] [num: gmake opam-legacy]
-> retrieved dune.3.16.0, dune-configurator.3.16.0  (cached)
Processing 58/191: [re2.v0.14.0: http] [shell.v0.14.0: http] [num: gmake opam-legacy]
Processing 59/191: [re2.v0.14.0: http] [shell.v0.14.0: http] [spawn.v0.15.1: extract] [num: gmake opam-legacy]
Processing 60/191: [re2.v0.14.0: http] [shell.v0.14.0: http] [spawn.v0.15.1: extract] [dune: ocaml 7] [num: gmake opam-legacy]
-> retrieved spawn.v0.15.1  (cached)
Processing 60/191: [re2.v0.14.0: http] [shell.v0.14.0: http] [dune: ocaml 7] [num: gmake opam-legacy]
Processing 61/191: [re2.v0.14.0: http] [shell.v0.14.0: http] [splittable_random.v0.14.0: extract] [dune: ocaml 7] [num: gmake opam-legacy]
Processing 61/191: [re2.v0.14.0: http] [shell.v0.14.0: extract] [splittable_random.v0.14.0: extract] [dune: ocaml 7] [num: gmake opam-legacy]
-> retrieved splittable_random.v0.14.0  (cached)
Processing 61/191: [re2.v0.14.0: http] [shell.v0.14.0: extract] [dune: ocaml 7] [num: gmake opam-legacy]
Processing 62/191: [re2.v0.14.0: http] [shell.v0.14.0: extract] [stdio.v0.14.0: extract] [dune: ocaml 7] [num: gmake opam-legacy]
-> retrieved shell.v0.14.0  (https://ocaml.janestreet.com/ocaml-core/v0.14/files/shell-v0.14.0.tar.gz)
Processing 62/191: [re2.v0.14.0: http] [stdio.v0.14.0: extract] [dune: ocaml 7] [num: gmake opam-legacy]
Processing 63/191: [re2.v0.14.0: http] [stdio.v0.14.0: extract] [stdlib-shims.0.3.0: extract] [dune: ocaml 7] [num: gmake opam-legacy]
-> retrieved stdio.v0.14.0  (cached)
Processing 63/191: [re2.v0.14.0: http] [stdlib-shims.0.3.0: extract] [dune: ocaml 7] [num: gmake opam-legacy]
Processing 64/191: [re2.v0.14.0: http] [stdlib-shims.0.3.0: extract] [textutils.v0.14.0: extract] [dune: ocaml 7] [num: gmake opam-legacy]
-> retrieved stdlib-shims.0.3.0  (cached)
Processing 64/191: [re2.v0.14.0: http] [textutils.v0.14.0: extract] [dune: ocaml 7] [num: gmake opam-legacy]
Processing 65/191: [re2.v0.14.0: http] [textutils.v0.14.0: extract] [textutils_kernel.v0.14.0: http] [dune: ocaml 7] [num: gmake opam-legacy]
-> retrieved textutils.v0.14.0  (cached)
Processing 65/191: [re2.v0.14.0: http] [textutils_kernel.v0.14.0: http] [dune: ocaml 7] [num: gmake opam-legacy]
Processing 66/191: [re2.v0.14.0: http] [textutils_kernel.v0.14.0: http] [time_now.v0.14.0: extract] [dune: ocaml 7] [num: gmake opam-legacy]
Processing 66/191: [re2.v0.14.0: extract] [textutils_kernel.v0.14.0: http] [time_now.v0.14.0: extract] [dune: ocaml 7] [num: gmake opam-legacy]
-> retrieved time_now.v0.14.0  (cached)
Processing 66/191: [re2.v0.14.0: extract] [textutils_kernel.v0.14.0: http] [dune: ocaml 7] [num: gmake opam-legacy]
Processing 67/191: [re2.v0.14.0: extract] [textutils_kernel.v0.14.0: http] [timezone.v0.14.0: extract] [dune: ocaml 7] [num: gmake opam-legacy]
-> retrieved re2.v0.14.0  (https://ocaml.janestreet.com/ocaml-core/v0.14/files/re2-v0.14.0.tar.gz)
Processing 67/191: [textutils_kernel.v0.14.0: http] [timezone.v0.14.0: extract] [dune: ocaml 7] [num: gmake opam-legacy]
Processing 68/191: [textutils_kernel.v0.14.0: http] [timezone.v0.14.0: extract] [typerep.v0.14.0: extract] [dune: ocaml 7] [num: gmake opam-legacy]
-> retrieved timezone.v0.14.0  (cached)
Processing 68/191: [textutils_kernel.v0.14.0: http] [typerep.v0.14.0: extract] [dune: ocaml 7] [num: gmake opam-legacy]
Processing 69/191: [textutils_kernel.v0.14.0: http] [typerep.v0.14.0: extract] [variantslib.v0.14.0: extract] [dune: ocaml 7] [num: gmake opam-legacy]
Processing 69/191: [textutils_kernel.v0.14.0: extract] [typerep.v0.14.0: extract] [variantslib.v0.14.0: extract] [dune: ocaml 7] [num: gmake opam-legacy]
-> retrieved variantslib.v0.14.0  (cached)
Processing 69/191: [textutils_kernel.v0.14.0: extract] [typerep.v0.14.0: extract] [dune: ocaml 7] [num: gmake opam-legacy]
-> retrieved textutils_kernel.v0.14.0  (https://ocaml.janestreet.com/ocaml-core/v0.14/files/textutils_kernel-v0.14.0.tar.gz)
Processing 69/191: [typerep.v0.14.0: extract] [dune: ocaml 7] [num: gmake opam-legacy]
-> retrieved typerep.v0.14.0  (cached)
Processing 69/191: [dune: ocaml 7] [num: gmake opam-legacy]
+ /usr/local/bin/gmake "PROFILE=release" "opam-legacy" (CWD=/home/opam/.opam/4.14.1/.opam-switch/build/num.1.5)
- /usr/local/bin/gmake -C src all
- gmake[1]: Entering directory '/home/opam/.opam/4.14.1/.opam-switch/build/num.1.5/src'
- ocamlc -ccopt -DBNG_ARCH_amd64 -c bng.c
- ocamlc -ccopt -DBNG_ARCH_amd64 -c nat_stubs.c
- ocamlmklib -oc nums bng.o nat_stubs.o
- ocamlc -w +a-4-9-41-42-44-45-48  -bin-annot -g -safe-string -strict-sequence -strict-formats -I +compiler-libs -c int_misc.mli
- ocamlc -w +a-4-9-41-42-44-45-48  -bin-annot -g -safe-string -strict-sequence -strict-formats -I +compiler-libs -c int_misc.ml
- ocamlc -w +a-4-9-41-42-44-45-48  -bin-annot -g -safe-string -strict-sequence -strict-formats -I +compiler-libs -c nat.mli
- ocamlc -w +a-4-9-41-42-44-45-48  -bin-annot -g -safe-string -strict-sequence -strict-formats -I +compiler-libs -c nat.ml
- ocamlc -w +a-4-9-41-42-44-45-48  -bin-annot -g -safe-string -strict-sequence -strict-formats -I +compiler-libs -c big_int.mli
- ocamlc -w +a-4-9-41-42-44-45-48  -bin-annot -g -safe-string -strict-sequence -strict-formats -I +compiler-libs -c big_int.ml
- ocamlc -w +a-4-9-41-42-44-45-48  -bin-annot -g -safe-string -strict-sequence -strict-formats -I +compiler-libs -c arith_flags.mli
- ocamlc -w +a-4-9-41-42-44-45-48  -bin-annot -g -safe-string -strict-sequence -strict-formats -I +compiler-libs -c arith_flags.ml
- ocamlc -w +a-4-9-41-42-44-45-48  -bin-annot -g -safe-string -strict-sequence -strict-formats -I +compiler-libs -c ratio.mli
- ocamlc -w +a-4-9-41-42-44-45-48  -bin-annot -g -safe-string -strict-sequence -strict-formats -I +compiler-libs -c ratio.ml
- ocamlc -w +a-4-9-41-42-44-45-48  -bin-annot -g -safe-string -strict-sequence -strict-formats -I +compiler-libs -c num.mli
- ocamlc -w +a-4-9-41-42-44-45-48  -bin-annot -g -safe-string -strict-sequence -strict-formats -I +compiler-libs -c num.ml
- ocamlc -w +a-4-9-41-42-44-45-48  -bin-annot -g -safe-string -strict-sequence -strict-formats -I +compiler-libs -c arith_status.mli
- ocamlc -w +a-4-9-41-42-44-45-48  -bin-annot -g -safe-string -strict-sequence -strict-formats -I +compiler-libs -c arith_status.ml
- ocamlmklib -o nums -oc nums -linkall int_misc.cmo nat.cmo big_int.cmo arith_flags.cmo ratio.cmo num.cmo arith_status.cmo
- cp ../toplevel/num_top_printers.mli ../toplevel/num_top.mli ../toplevel/num_top_printers.ml ../toplevel/num_top.ml .
- ocamlc -w +a-4-9-41-42-44-45-48  -bin-annot -g -safe-string -strict-sequence -strict-formats -I +compiler-libs -c num_top_printers.mli
- ocamlc -w +a-4-9-41-42-44-45-48  -bin-annot -g -safe-string -strict-sequence -strict-formats -I +compiler-libs -c num_top_printers.ml
- ocamlc -w +a-4-9-41-42-44-45-48  -bin-annot -g -safe-string -strict-sequence -strict-formats -I +compiler-libs -c num_top.mli
- ocamlc -w +a-4-9-41-42-44-45-48  -bin-annot -g -safe-string -strict-sequence -strict-formats -I +compiler-libs -c num_top.ml
- ocamlc -w +a-4-9-41-42-44-45-48  -bin-annot -g -safe-string -strict-sequence -strict-formats -I +compiler-libs -a -o num_top.cma num_top_printers.cmo num_top.cmo
- echo 'version = "1.6~dev"' > META.top
- cat META.num-top.in >> META.top
- ocamlopt -w +a-4-9-41-42-44-45-48  -bin-annot -g -safe-string -strict-sequence -strict-formats -I +compiler-libs -c int_misc.ml
- ocamlopt -w +a-4-9-41-42-44-45-48  -bin-annot -g -safe-string -strict-sequence -strict-formats -I +compiler-libs -c nat.ml
- ocamlopt -w +a-4-9-41-42-44-45-48  -bin-annot -g -safe-string -strict-sequence -strict-formats -I +compiler-libs -c big_int.ml
- ocamlopt -w +a-4-9-41-42-44-45-48  -bin-annot -g -safe-string -strict-sequence -strict-formats -I +compiler-libs -c arith_flags.ml
- ocamlopt -w +a-4-9-41-42-44-45-48  -bin-annot -g -safe-string -strict-sequence -strict-formats -I +compiler-libs -c ratio.ml
- ocamlopt -w +a-4-9-41-42-44-45-48  -bin-annot -g -safe-string -strict-sequence -strict-formats -I +compiler-libs -c num.ml
- ocamlopt -w +a-4-9-41-42-44-45-48  -bin-annot -g -safe-string -strict-sequence -strict-formats -I +compiler-libs -c arith_status.ml
- ocamlmklib -o nums -oc nums -linkall int_misc.cmx nat.cmx big_int.cmx arith_flags.cmx ratio.cmx num.cmx arith_status.cmx
- ocamlopt -w +a-4-9-41-42-44-45-48  -bin-annot -g -safe-string -strict-sequence -strict-formats -I +compiler-libs -I . -shared -o nums.cmxs nums.cmxa
- gmake[1]: Leaving directory '/home/opam/.opam/4.14.1/.opam-switch/build/num.1.5/src'
- cp src/num-legacy.install num.install
-> compiled  num.1.5
Processing 69/191: [dune: ocaml 7]
-> installed num.1.5
Processing 70/191: [dune: ocaml 7]
+ /home/opam/.opam/4.14.1/bin/ocaml "boot/bootstrap.ml" "-j" "7" (CWD=/home/opam/.opam/4.14.1/.opam-switch/build/dune.3.16.0)
- ocamlc -output-complete-exe -w -24 -g -o .duneboot.exe -I boot unix.cma boot/libs.ml boot/duneboot.ml
- /tmp/camlobj11f3ed.c:16582:14: warning: a function declaration without a prototype is deprecated in all versions of C and is treated as a zero-parameter prototype in C2x, conflicting with a previous declaration [-Wdeprecated-non-prototype]
- extern value caml_get_public_method();
-              ^
- /home/opam/.opam/4.14.1/lib/ocaml/caml/mlvalues.h:236:18: note: conflicting prototype is here
- CAMLextern value caml_get_public_method (value obj, value tag);
-                  ^
- /tmp/camlobj11f3ed.c:16764:14: warning: a function declaration without a prototype is deprecated in all versions of C and is treated as a zero-parameter prototype in C2x, conflicting with a previous declaration [-Wdeprecated-non-prototype]
- extern value caml_set_oo_id();
-              ^
- /home/opam/.opam/4.14.1/lib/ocaml/caml/mlvalues.h:413:18: note: conflicting prototype is here
- CAMLextern value caml_set_oo_id(value obj);
-                  ^
- 2 warnings generated.
- ./.duneboot.exe -j 7
- 

Processing 70/191: [dune: ./_boot/dune.exe build]
+ /home/opam/.opam/4.14.1/.opam-switch/build/dune.3.16.0/./_boot/dune.exe "build" "dune.install" "--release" "--profile" "dune-bootstrap" "-j" "7" (CWD=/home/opam/.opam/4.14.1/.opam-switch/build/dune.3.16.0)
-> compiled  dune.3.16.0
-> installed dune.3.16.0
Processing 72/191: [csexp: dune build]
Processing 73/191: [csexp: dune build] [jane-street-headers: dune build]
Processing 74/191: [csexp: dune build] [jane-street-headers: dune build] [ocaml-compiler-libs: dune build]
Processing 75/191: [csexp: dune build] [jane-street-headers: dune build] [ocaml-compiler-libs: dune build] [octavius: dune build]
Processing 76/191: [csexp: dune build] [jane-street-headers: dune build] [ocaml-compiler-libs: dune build] [octavius: dune build] [ppx_derivers: dune build]
Processing 77/191: [csexp: dune build] [jane-street-headers: dune build] [ocaml-compiler-libs: dune build] [octavius: dune build] [ppx_derivers: dune build] [re: dune build]
Processing 78/191: [csexp: dune build] [jane-street-headers: dune build] [ocaml-compiler-libs: dune build] [octavius: dune build] [ppx_derivers: dune build] [re: dune build] [sexplib0: dune build]
+ /home/opam/.opam/4.14.1/bin/dune "build" "-p" "csexp" "-j" "7" "@install" (CWD=/home/opam/.opam/4.14.1/.opam-switch/build/csexp.1.5.2)
-> compiled  csexp.1.5.2
Processing 78/191: [jane-street-headers: dune build] [ocaml-compiler-libs: dune build] [octavius: dune build] [ppx_derivers: dune build] [re: dune build] [sexplib0: dune build]
Processing 79/191: [jane-street-headers: dune build] [ocaml-compiler-libs: dune build] [octavius: dune build] [ppx_derivers: dune build] [re: dune build] [sexplib0: dune build] [spawn: dune build]
-> installed csexp.1.5.2
Processing 80/191: [jane-street-headers: dune build] [ocaml-compiler-libs: dune build] [octavius: dune build] [ppx_derivers: dune build] [re: dune build] [sexplib0: dune build] [spawn: dune build]
+ /home/opam/.opam/4.14.1/bin/dune "build" "-p" "jane-street-headers" "-j" "7" (CWD=/home/opam/.opam/4.14.1/.opam-switch/build/jane-street-headers.v0.14.0)
-> compiled  jane-street-headers.v0.14.0
Processing 80/191: [ocaml-compiler-libs: dune build] [octavius: dune build] [ppx_derivers: dune build] [re: dune build] [sexplib0: dune build] [spawn: dune build]
Processing 81/191: [dune-configurator: rm] [ocaml-compiler-libs: dune build] [octavius: dune build] [ppx_derivers: dune build] [re: dune build] [sexplib0: dune build] [spawn: dune build]
-> installed jane-street-headers.v0.14.0
Processing 82/191: [dune-configurator: rm] [ocaml-compiler-libs: dune build] [octavius: dune build] [ppx_derivers: dune build] [re: dune build] [sexplib0: dune build] [spawn: dune build]
+ /bin/rm "-rf" "vendor/csexp" (CWD=/home/opam/.opam/4.14.1/.opam-switch/build/dune-configurator.3.16.0)
+ /home/opam/.opam/4.14.1/bin/dune "build" "-p" "spawn" "-j" "7" "@install" (CWD=/home/opam/.opam/4.14.1/.opam-switch/build/spawn.v0.15.1)
-> compiled  spawn.v0.15.1
Processing 82/191: [dune-configurator: rm] [ocaml-compiler-libs: dune build] [octavius: dune build] [ppx_derivers: dune build] [re: dune build] [sexplib0: dune build]
Processing 83/191: [dune-configurator: rm] [ocaml-compiler-libs: dune build] [octavius: dune build] [ppx_derivers: dune build] [re: dune build] [sexplib0: dune build] [stdlib-shims: dune build]
-> installed spawn.v0.15.1
Processing 84/191: [dune-configurator: rm] [ocaml-compiler-libs: dune build] [octavius: dune build] [ppx_derivers: dune build] [re: dune build] [sexplib0: dune build] [stdlib-shims: dune build]
+ /bin/rm "-rf" "vendor/pp" (CWD=/home/opam/.opam/4.14.1/.opam-switch/build/dune-configurator.3.16.0)
Processing 84/191: [dune-configurator: dune build] [ocaml-compiler-libs: dune build] [octavius: dune build] [ppx_derivers: dune build] [re: dune build] [sexplib0: dune build] [stdlib-shims: dune build]
+ /home/opam/.opam/4.14.1/bin/dune "build" "-p" "sexplib0" "-j" "7" (CWD=/home/opam/.opam/4.14.1/.opam-switch/build/sexplib0.v0.14.0)
- (cd _build/default && /home/opam/.opam/4.14.1/bin/ocamlc.opt -w -40 -g -bin-annot -I src/.sexplib0.objs/byte -intf-suffix .ml -no-alias-deps -open Sexplib0__ -o src/.sexplib0.objs/byte/sexplib0__Sexp_conv.cmo -c -impl src/sexp_conv.ml)
- File "src/sexp_conv.ml", line 132, characters 17-36:
- 132 |       let ephe = Ephemeron.K1.create () in
-                        ^^^^^^^^^^^^^^^^^^^
- Alert old_ephemeron_api: Stdlib.Ephemeron.K1.create
- This function won't be available in 5.0
- File "src/sexp_conv.ml", line 133, characters 6-27:
- 133 |       Ephemeron.K1.set_data ephe sexp_of_exn;
-             ^^^^^^^^^^^^^^^^^^^^^
- Alert old_ephemeron_api: Stdlib.Ephemeron.K1.set_data
- This function won't be available in 5.0
- File "src/sexp_conv.ml", line 134, characters 6-26:
- 134 |       Ephemeron.K1.set_key ephe extension_constructor;
-             ^^^^^^^^^^^^^^^^^^^^
- Alert old_ephemeron_api: Stdlib.Ephemeron.K1.set_key
- This function won't be available in 5.0
- File "src/sexp_conv.ml", line 159, characters 12-33:
- 159 |       match Ephemeron.K1.get_data ephe with
-                   ^^^^^^^^^^^^^^^^^^^^^
- Alert old_ephemeron_api: Stdlib.Ephemeron.K1.get_data
- This function won't be available in 5.0
- File "src/sexp_conv.ml", line 166, characters 12-33:
- 166 |       match Ephemeron.K1.get_data ephe with
-                   ^^^^^^^^^^^^^^^^^^^^^
- Alert old_ephemeron_api: Stdlib.Ephemeron.K1.get_data
- This function won't be available in 5.0
- File "src/sexp_conv.ml", line 431, characters 32-46:
- 431 |         [%extension_constructor Stream.Failure],
-                                       ^^^^^^^^^^^^^^
- Alert deprecated: module Stdlib.Stream
- Use the camlp-streams library instead.
- File "src/sexp_conv.ml", line 433, characters 12-26:
- 433 |           | Stream.Failure -> Atom "Stream.Failure"
-                   ^^^^^^^^^^^^^^
- Alert deprecated: module Stdlib.Stream
- Use the camlp-streams library instead.
- File "src/sexp_conv.ml", line 436, characters 32-44:
- 436 |         [%extension_constructor Stream.Error],
-                                       ^^^^^^^^^^^^
- Alert deprecated: module Stdlib.Stream
- Use the camlp-streams library instead.
- File "src/sexp_conv.ml", line 438, characters 12-24:
- 438 |           | Stream.Error arg -> List [Atom "Stream.Error"; Atom arg ]
-                   ^^^^^^^^^^^^
- Alert deprecated: module Stdlib.Stream
- Use the camlp-streams library instead.
- (cd _build/default && /home/opam/.opam/4.14.1/bin/ocamlopt.opt -w -40 -g -I src/.sexplib0.objs/byte -I src/.sexplib0.objs/native -intf-suffix .ml -no-alias-deps -open Sexplib0__ -o src/.sexplib0.objs/native/sexplib0__Sexp_conv.cmx -c -impl src/sexp_conv.ml)
- File "src/sexp_conv.ml", line 132, characters 17-36:
- 132 |       let ephe = Ephemeron.K1.create () in
-                        ^^^^^^^^^^^^^^^^^^^
- Alert old_ephemeron_api: Stdlib.Ephemeron.K1.create
- This function won't be available in 5.0
- File "src/sexp_conv.ml", line 133, characters 6-27:
- 133 |       Ephemeron.K1.set_data ephe sexp_of_exn;
-             ^^^^^^^^^^^^^^^^^^^^^
- Alert old_ephemeron_api: Stdlib.Ephemeron.K1.set_data
- This function won't be available in 5.0
- File "src/sexp_conv.ml", line 134, characters 6-26:
- 134 |       Ephemeron.K1.set_key ephe extension_constructor;
-             ^^^^^^^^^^^^^^^^^^^^
- Alert old_ephemeron_api: Stdlib.Ephemeron.K1.set_key
- This function won't be available in 5.0
- File "src/sexp_conv.ml", line 159, characters 12-33:
- 159 |       match Ephemeron.K1.get_data ephe with
-                   ^^^^^^^^^^^^^^^^^^^^^
- Alert old_ephemeron_api: Stdlib.Ephemeron.K1.get_data
- This function won't be available in 5.0
- File "src/sexp_conv.ml", line 166, characters 12-33:
- 166 |       match Ephemeron.K1.get_data ephe with
-                   ^^^^^^^^^^^^^^^^^^^^^
- Alert old_ephemeron_api: Stdlib.Ephemeron.K1.get_data
- This function won't be available in 5.0
- File "src/sexp_conv.ml", line 431, characters 32-46:
- 431 |         [%extension_constructor Stream.Failure],
-                                       ^^^^^^^^^^^^^^
- Alert deprecated: module Stdlib.Stream
- Use the camlp-streams library instead.
- File "src/sexp_conv.ml", line 433, characters 12-26:
- 433 |           | Stream.Failure -> Atom "Stream.Failure"
-                   ^^^^^^^^^^^^^^
- Alert deprecated: module Stdlib.Stream
- Use the camlp-streams library instead.
- File "src/sexp_conv.ml", line 436, characters 32-44:
- 436 |         [%extension_constructor Stream.Error],
-                                       ^^^^^^^^^^^^
- Alert deprecated: module Stdlib.Stream
- Use the camlp-streams library instead.
- File "src/sexp_conv.ml", line 438, characters 12-24:
- 438 |           | Stream.Error arg -> List [Atom "Stream.Error"; Atom arg ]
-                   ^^^^^^^^^^^^
- Alert deprecated: module Stdlib.Stream
- Use the camlp-streams library instead.
-> compiled  sexplib0.v0.14.0
Processing 84/191: [dune-configurator: dune build] [ocaml-compiler-libs: dune build] [octavius: dune build] [ppx_derivers: dune build] [re: dune build] [stdlib-shims: dune build]
-> installed sexplib0.v0.14.0
Processing 85/191: [dune-configurator: dune build] [ocaml-compiler-libs: dune build] [octavius: dune build] [ppx_derivers: dune build] [re: dune build] [stdlib-shims: dune build]
+ /home/opam/.opam/4.14.1/bin/dune "build" "-p" "re" "-j" "7" (CWD=/home/opam/.opam/4.14.1/.opam-switch/build/re.1.11.0)
-> compiled  re.1.11.0
Processing 85/191: [dune-configurator: dune build] [ocaml-compiler-libs: dune build] [octavius: dune build] [ppx_derivers: dune build] [stdlib-shims: dune build]
-> installed re.1.11.0
Processing 86/191: [dune-configurator: dune build] [ocaml-compiler-libs: dune build] [octavius: dune build] [ppx_derivers: dune build] [stdlib-shims: dune build]
+ /home/opam/.opam/4.14.1/bin/dune "build" "-p" "ppx_derivers" "-j" "7" (CWD=/home/opam/.opam/4.14.1/.opam-switch/build/ppx_derivers.1.2.1)
-> compiled  ppx_derivers.1.2.1
Processing 86/191: [dune-configurator: dune build] [ocaml-compiler-libs: dune build] [octavius: dune build] [stdlib-shims: dune build]
-> installed ppx_derivers.1.2.1
Processing 87/191: [dune-configurator: dune build] [ocaml-compiler-libs: dune build] [octavius: dune build] [stdlib-shims: dune build]
+ /home/opam/.opam/4.14.1/bin/dune "build" "-p" "octavius" "-j" "7" "@install" (CWD=/home/opam/.opam/4.14.1/.opam-switch/build/octavius.1.2.2)
-> compiled  octavius.1.2.2
Processing 87/191: [dune-configurator: dune build] [ocaml-compiler-libs: dune build] [stdlib-shims: dune build]
-> installed octavius.1.2.2
Processing 88/191: [dune-configurator: dune build] [ocaml-compiler-libs: dune build] [stdlib-shims: dune build]
+ /home/opam/.opam/4.14.1/bin/dune "build" "-p" "ocaml-compiler-libs" "-j" "7" "@install" (CWD=/home/opam/.opam/4.14.1/.opam-switch/build/ocaml-compiler-libs.v0.12.4)
-> compiled  ocaml-compiler-libs.v0.12.4
Processing 88/191: [dune-configurator: dune build] [stdlib-shims: dune build]
-> installed ocaml-compiler-libs.v0.12.4
Processing 89/191: [dune-configurator: dune build] [stdlib-shims: dune build]
+ /home/opam/.opam/4.14.1/bin/dune "build" "-p" "stdlib-shims" "-j" "7" (CWD=/home/opam/.opam/4.14.1/.opam-switch/build/stdlib-shims.0.3.0)
-> compiled  stdlib-shims.0.3.0
Processing 89/191: [dune-configurator: dune build]
-> installed stdlib-shims.0.3.0
Processing 90/191: [dune-configurator: dune build]
Processing 91/191: [dune-configurator: dune build] [ppxlib: dune build]
+ /home/opam/.opam/4.14.1/bin/dune "build" "-p" "dune-configurator" "-j" "7" "@install" (CWD=/home/opam/.opam/4.14.1/.opam-switch/build/dune-configurator.3.16.0)
-> compiled  dune-configurator.3.16.0
Processing 91/191: [ppxlib: dune build]
-> installed dune-configurator.3.16.0
Processing 92/191: [ppxlib: dune build]
Processing 93/191: [base: dune build] [ppxlib: dune build]
+ /home/opam/.opam/4.14.1/bin/dune "build" "-p" "base" "-j" "7" (CWD=/home/opam/.opam/4.14.1/.opam-switch/build/base.v0.14.3)
-> compiled  base.v0.14.3
Processing 93/191: [ppxlib: dune build]
-> installed base.v0.14.3
Processing 94/191: [ppxlib: dune build]
Processing 95/191: [fieldslib: dune build] [ppxlib: dune build]
Processing 96/191: [fieldslib: dune build] [parsexp: dune build] [ppxlib: dune build]
Processing 97/191: [fieldslib: dune build] [parsexp: dune build] [ppxlib: dune build] [stdio: dune build]
Processing 98/191: [fieldslib: dune build] [parsexp: dune build] [ppxlib: dune build] [stdio: dune build] [typerep: dune build]
Processing 99/191: [fieldslib: dune build] [parsexp: dune build] [ppxlib: dune build] [stdio: dune build] [typerep: dune build] [variantslib: dune build]
+ /home/opam/.opam/4.14.1/bin/dune "build" "-p" "variantslib" "-j" "7" (CWD=/home/opam/.opam/4.14.1/.opam-switch/build/variantslib.v0.14.0)
-> compiled  variantslib.v0.14.0
Processing 99/191: [fieldslib: dune build] [parsexp: dune build] [ppxlib: dune build] [stdio: dune build] [typerep: dune build]
-> installed variantslib.v0.14.0
Processing 100/191: [fieldslib: dune build] [parsexp: dune build] [ppxlib: dune build] [stdio: dune build] [typerep: dune build]
+ /home/opam/.opam/4.14.1/bin/dune "build" "-p" "stdio" "-j" "7" (CWD=/home/opam/.opam/4.14.1/.opam-switch/build/stdio.v0.14.0)
-> compiled  stdio.v0.14.0
Processing 100/191: [fieldslib: dune build] [parsexp: dune build] [ppxlib: dune build] [typerep: dune build]
-> installed stdio.v0.14.0
Processing 101/191: [fieldslib: dune build] [parsexp: dune build] [ppxlib: dune build] [typerep: dune build]
+ /home/opam/.opam/4.14.1/bin/dune "build" "-p" "fieldslib" "-j" "7" (CWD=/home/opam/.opam/4.14.1/.opam-switch/build/fieldslib.v0.14.0)
-> compiled  fieldslib.v0.14.0
Processing 101/191: [parsexp: dune build] [ppxlib: dune build] [typerep: dune build]
-> installed fieldslib.v0.14.0
Processing 102/191: [parsexp: dune build] [ppxlib: dune build] [typerep: dune build]
+ /home/opam/.opam/4.14.1/bin/dune "build" "-p" "typerep" "-j" "7" (CWD=/home/opam/.opam/4.14.1/.opam-switch/build/typerep.v0.14.0)
-> compiled  typerep.v0.14.0
Processing 102/191: [parsexp: dune build] [ppxlib: dune build]
-> installed typerep.v0.14.0
Processing 103/191: [parsexp: dune build] [ppxlib: dune build]
+ /home/opam/.opam/4.14.1/bin/dune "build" "-p" "parsexp" "-j" "7" (CWD=/home/opam/.opam/4.14.1/.opam-switch/build/parsexp.v0.14.2)
-> compiled  parsexp.v0.14.2
Processing 103/191: [ppxlib: dune build]
-> installed parsexp.v0.14.2
Processing 104/191: [ppxlib: dune build]
Processing 105/191: [ppxlib: dune build] [sexplib: dune build]
+ /home/opam/.opam/4.14.1/bin/dune "build" "-p" "ppxlib" "-j" "7" "@install" (CWD=/home/opam/.opam/4.14.1/.opam-switch/build/ppxlib.0.25.1)
-> compiled  ppxlib.0.25.1
Processing 105/191: [sexplib: dune build]
-> installed ppxlib.0.25.1
Processing 106/191: [sexplib: dune build]
Processing 107/191: [ppx_cold: dune build] [sexplib: dune build]
Processing 108/191: [ppx_cold: dune build] [ppx_compare: dune build] [sexplib: dune build]
Processing 109/191: [ppx_cold: dune build] [ppx_compare: dune build] [ppx_enumerate: dune build] [sexplib: dune build]
Processing 110/191: [ppx_cold: dune build] [ppx_compare: dune build] [ppx_enumerate: dune build] [ppx_fields_conv: dune build] [sexplib: dune build]
Processing 111/191: [ppx_cold: dune build] [ppx_compare: dune build] [ppx_enumerate: dune build] [ppx_fields_conv: dune build] [ppx_fixed_literal: dune build] [sexplib: dune build]
Processing 112/191: [ppx_cold: dune build] [ppx_compare: dune build] [ppx_enumerate: dune build] [ppx_fields_conv: dune build] [ppx_fixed_literal: dune build] [ppx_here: dune build] [sexplib: dune build]
+ /home/opam/.opam/4.14.1/bin/dune "build" "-p" "ppx_cold" "-j" "7" (CWD=/home/opam/.opam/4.14.1/.opam-switch/build/ppx_cold.v0.14.0)
-> compiled  ppx_cold.v0.14.0
Processing 112/191: [ppx_compare: dune build] [ppx_enumerate: dune build] [ppx_fields_conv: dune build] [ppx_fixed_literal: dune build] [ppx_here: dune build] [sexplib: dune build]
Processing 113/191: [ppx_compare: dune build] [ppx_enumerate: dune build] [ppx_fields_conv: dune build] [ppx_fixed_literal: dune build] [ppx_here: dune build] [ppx_js_style: dune build] [sexplib: dune build]
-> installed ppx_cold.v0.14.0
Processing 114/191: [ppx_compare: dune build] [ppx_enumerate: dune build] [ppx_fields_conv: dune build] [ppx_fixed_literal: dune build] [ppx_here: dune build] [ppx_js_style: dune build] [sexplib: dune build]
+ /home/opam/.opam/4.14.1/bin/dune "build" "-p" "sexplib" "-j" "7" (CWD=/home/opam/.opam/4.14.1/.opam-switch/build/sexplib.v0.14.0)
-> compiled  sexplib.v0.14.0
Processing 114/191: [ppx_compare: dune build] [ppx_enumerate: dune build] [ppx_fields_conv: dune build] [ppx_fixed_literal: dune build] [ppx_here: dune build] [ppx_js_style: dune build]
Processing 115/191: [ppx_compare: dune build] [ppx_enumerate: dune build] [ppx_fields_conv: dune build] [ppx_fixed_literal: dune build] [ppx_here: dune build] [ppx_js_style: dune build] [ppx_let: dune build]
-> installed sexplib.v0.14.0
Processing 116/191: [ppx_compare: dune build] [ppx_enumerate: dune build] [ppx_fields_conv: dune build] [ppx_fixed_literal: dune build] [ppx_here: dune build] [ppx_js_style: dune build] [ppx_let: dune build]
+ /home/opam/.opam/4.14.1/bin/dune "build" "-p" "ppx_enumerate" "-j" "7" (CWD=/home/opam/.opam/4.14.1/.opam-switch/build/ppx_enumerate.v0.14.0)
-> compiled  ppx_enumerate.v0.14.0
Processing 116/191: [ppx_compare: dune build] [ppx_fields_conv: dune build] [ppx_fixed_literal: dune build] [ppx_here: dune build] [ppx_js_style: dune build] [ppx_let: dune build]
Processing 117/191: [ppx_compare: dune build] [ppx_fields_conv: dune build] [ppx_fixed_literal: dune build] [ppx_here: dune build] [ppx_js_style: dune build] [ppx_let: dune build] [ppx_optcomp: dune build]
-> installed ppx_enumerate.v0.14.0
Processing 118/191: [ppx_compare: dune build] [ppx_fields_conv: dune build] [ppx_fixed_literal: dune build] [ppx_here: dune build] [ppx_js_style: dune build] [ppx_let: dune build] [ppx_optcomp: dune build]
+ /home/opam/.opam/4.14.1/bin/dune "build" "-p" "ppx_here" "-j" "7" (CWD=/home/opam/.opam/4.14.1/.opam-switch/build/ppx_here.v0.14.0)
-> compiled  ppx_here.v0.14.0
Processing 118/191: [ppx_compare: dune build] [ppx_fields_conv: dune build] [ppx_fixed_literal: dune build] [ppx_js_style: dune build] [ppx_let: dune build] [ppx_optcomp: dune build]
Processing 119/191: [ppx_compare: dune build] [ppx_fields_conv: dune build] [ppx_fixed_literal: dune build] [ppx_js_style: dune build] [ppx_let: dune build] [ppx_optcomp: dune build] [ppx_optional: dune build]
-> installed ppx_here.v0.14.0
Processing 120/191: [ppx_compare: dune build] [ppx_fields_conv: dune build] [ppx_fixed_literal: dune build] [ppx_js_style: dune build] [ppx_let: dune build] [ppx_optcomp: dune build] [ppx_optional: dune build]
+ /home/opam/.opam/4.14.1/bin/dune "build" "-p" "ppx_fields_conv" "-j" "7" (CWD=/home/opam/.opam/4.14.1/.opam-switch/build/ppx_fields_conv.v0.14.2)
-> compiled  ppx_fields_conv.v0.14.2
Processing 120/191: [ppx_compare: dune build] [ppx_fixed_literal: dune build] [ppx_js_style: dune build] [ppx_let: dune build] [ppx_optcomp: dune build] [ppx_optional: dune build]
Processing 121/191: [ppx_compare: dune build] [ppx_fixed_literal: dune build] [ppx_js_style: dune build] [ppx_let: dune build] [ppx_optcomp: dune build] [ppx_optional: dune build] [ppx_pipebang: dune build]
-> installed ppx_fields_conv.v0.14.2
Processing 122/191: [ppx_compare: dune build] [ppx_fixed_literal: dune build] [ppx_js_style: dune build] [ppx_let: dune build] [ppx_optcomp: dune build] [ppx_optional: dune build] [ppx_pipebang: dune build]
+ /home/opam/.opam/4.14.1/bin/dune "build" "-p" "ppx_fixed_literal" "-j" "7" (CWD=/home/opam/.opam/4.14.1/.opam-switch/build/ppx_fixed_literal.v0.14.0)
-> compiled  ppx_fixed_literal.v0.14.0
Processing 122/191: [ppx_compare: dune build] [ppx_js_style: dune build] [ppx_let: dune build] [ppx_optcomp: dune build] [ppx_optional: dune build] [ppx_pipebang: dune build]
Processing 123/191: [ppx_compare: dune build] [ppx_js_style: dune build] [ppx_let: dune build] [ppx_optcomp: dune build] [ppx_optional: dune build] [ppx_pipebang: dune build] [ppx_sexp_conv: dune build]
-> installed ppx_fixed_literal.v0.14.0
Processing 124/191: [ppx_compare: dune build] [ppx_js_style: dune build] [ppx_let: dune build] [ppx_optcomp: dune build] [ppx_optional: dune build] [ppx_pipebang: dune build] [ppx_sexp_conv: dune build]
+ /home/opam/.opam/4.14.1/bin/dune "build" "-p" "ppx_let" "-j" "7" (CWD=/home/opam/.opam/4.14.1/.opam-switch/build/ppx_let.v0.14.0)
-> compiled  ppx_let.v0.14.0
Processing 124/191: [ppx_compare: dune build] [ppx_js_style: dune build] [ppx_optcomp: dune build] [ppx_optional: dune build] [ppx_pipebang: dune build] [ppx_sexp_conv: dune build]
Processing 125/191: [ppx_compare: dune build] [ppx_js_style: dune build] [ppx_optcomp: dune build] [ppx_optional: dune build] [ppx_pipebang: dune build] [ppx_sexp_conv: dune build] [ppx_stable: dune build]
-> installed ppx_let.v0.14.0
Processing 126/191: [ppx_compare: dune build] [ppx_js_style: dune build] [ppx_optcomp: dune build] [ppx_optional: dune build] [ppx_pipebang: dune build] [ppx_sexp_conv: dune build] [ppx_stable: dune build]
+ /home/opam/.opam/4.14.1/bin/dune "build" "-p" "ppx_compare" "-j" "7" (CWD=/home/opam/.opam/4.14.1/.opam-switch/build/ppx_compare.v0.14.0)
-> compiled  ppx_compare.v0.14.0
Processing 126/191: [ppx_js_style: dune build] [ppx_optcomp: dune build] [ppx_optional: dune build] [ppx_pipebang: dune build] [ppx_sexp_conv: dune build] [ppx_stable: dune build]
Processing 127/191: [ppx_js_style: dune build] [ppx_optcomp: dune build] [ppx_optional: dune build] [ppx_pipebang: dune build] [ppx_sexp_conv: dune build] [ppx_stable: dune build] [ppx_typerep_conv: dune build]
-> installed ppx_compare.v0.14.0
Processing 128/191: [ppx_js_style: dune build] [ppx_optcomp: dune build] [ppx_optional: dune build] [ppx_pipebang: dune build] [ppx_sexp_conv: dune build] [ppx_stable: dune build] [ppx_typerep_conv: dune build]
+ /home/opam/.opam/4.14.1/bin/dune "build" "-p" "ppx_optcomp" "-j" "7" (CWD=/home/opam/.opam/4.14.1/.opam-switch/build/ppx_optcomp.v0.14.3)
-> compiled  ppx_optcomp.v0.14.3
Processing 128/191: [ppx_js_style: dune build] [ppx_optional: dune build] [ppx_pipebang: dune build] [ppx_sexp_conv: dune build] [ppx_stable: dune build] [ppx_typerep_conv: dune build]
Processing 129/191: [ppx_js_style: dune build] [ppx_optional: dune build] [ppx_pipebang: dune build] [ppx_sexp_conv: dune build] [ppx_stable: dune build] [ppx_typerep_conv: dune build] [ppx_variants_conv: dune build]
-> installed ppx_optcomp.v0.14.3
Processing 130/191: [ppx_js_style: dune build] [ppx_optional: dune build] [ppx_pipebang: dune build] [ppx_sexp_conv: dune build] [ppx_stable: dune build] [ppx_typerep_conv: dune build] [ppx_variants_conv: dune build]
+ /home/opam/.opam/4.14.1/bin/dune "build" "-p" "ppx_js_style" "-j" "7" (CWD=/home/opam/.opam/4.14.1/.opam-switch/build/ppx_js_style.v0.14.1)
-> compiled  ppx_js_style.v0.14.1
Processing 130/191: [ppx_optional: dune build] [ppx_pipebang: dune build] [ppx_sexp_conv: dune build] [ppx_stable: dune build] [ppx_typerep_conv: dune build] [ppx_variants_conv: dune build]
-> installed ppx_js_style.v0.14.1
Processing 131/191: [ppx_optional: dune build] [ppx_pipebang: dune build] [ppx_sexp_conv: dune build] [ppx_stable: dune build] [ppx_typerep_conv: dune build] [ppx_variants_conv: dune build]
+ /home/opam/.opam/4.14.1/bin/dune "build" "-p" "ppx_pipebang" "-j" "7" (CWD=/home/opam/.opam/4.14.1/.opam-switch/build/ppx_pipebang.v0.14.0)
-> compiled  ppx_pipebang.v0.14.0
Processing 131/191: [ppx_optional: dune build] [ppx_sexp_conv: dune build] [ppx_stable: dune build] [ppx_typerep_conv: dune build] [ppx_variants_conv: dune build]
-> installed ppx_pipebang.v0.14.0
Processing 132/191: [ppx_optional: dune build] [ppx_sexp_conv: dune build] [ppx_stable: dune build] [ppx_typerep_conv: dune build] [ppx_variants_conv: dune build]
+ /home/opam/.opam/4.14.1/bin/dune "build" "-p" "ppx_stable" "-j" "7" (CWD=/home/opam/.opam/4.14.1/.opam-switch/build/ppx_stable.v0.14.1)
-> compiled  ppx_stable.v0.14.1
Processing 132/191: [ppx_optional: dune build] [ppx_sexp_conv: dune build] [ppx_typerep_conv: dune build] [ppx_variants_conv: dune build]
-> installed ppx_stable.v0.14.1
Processing 133/191: [ppx_optional: dune build] [ppx_sexp_conv: dune build] [ppx_typerep_conv: dune build] [ppx_variants_conv: dune build]
+ /home/opam/.opam/4.14.1/bin/dune "build" "-p" "ppx_variants_conv" "-j" "7" (CWD=/home/opam/.opam/4.14.1/.opam-switch/build/ppx_variants_conv.v0.14.2)
-> compiled  ppx_variants_conv.v0.14.2
Processing 133/191: [ppx_optional: dune build] [ppx_sexp_conv: dune build] [ppx_typerep_conv: dune build]
-> installed ppx_variants_conv.v0.14.2
Processing 134/191: [ppx_optional: dune build] [ppx_sexp_conv: dune build] [ppx_typerep_conv: dune build]
+ /home/opam/.opam/4.14.1/bin/dune "build" "-p" "ppx_optional" "-j" "7" (CWD=/home/opam/.opam/4.14.1/.opam-switch/build/ppx_optional.v0.14.0)
-> compiled  ppx_optional.v0.14.0
Processing 134/191: [ppx_sexp_conv: dune build] [ppx_typerep_conv: dune build]
-> installed ppx_optional.v0.14.0
Processing 135/191: [ppx_sexp_conv: dune build] [ppx_typerep_conv: dune build]
+ /home/opam/.opam/4.14.1/bin/dune "build" "-p" "ppx_typerep_conv" "-j" "7" (CWD=/home/opam/.opam/4.14.1/.opam-switch/build/ppx_typerep_conv.v0.14.2)
-> compiled  ppx_typerep_conv.v0.14.2
Processing 135/191: [ppx_sexp_conv: dune build]
-> installed ppx_typerep_conv.v0.14.2
Processing 136/191: [ppx_sexp_conv: dune build]
+ /home/opam/.opam/4.14.1/bin/dune "build" "-p" "ppx_sexp_conv" "-j" "7" (CWD=/home/opam/.opam/4.14.1/.opam-switch/build/ppx_sexp_conv.v0.14.3)
-> compiled  ppx_sexp_conv.v0.14.3
-> installed ppx_sexp_conv.v0.14.3
Processing 138/191: [ppx_assert: dune build]
Processing 139/191: [ppx_assert: dune build] [ppx_custom_printf: dune build]
Processing 140/191: [ppx_assert: dune build] [ppx_custom_printf: dune build] [ppx_hash: dune build]
Processing 141/191: [ppx_assert: dune build] [ppx_custom_printf: dune build] [ppx_hash: dune build] [ppx_sexp_message: dune build]
Processing 142/191: [ppx_assert: dune build] [ppx_custom_printf: dune build] [ppx_hash: dune build] [ppx_sexp_message: dune build] [ppx_sexp_value: dune build]
+ /home/opam/.opam/4.14.1/bin/dune "build" "-p" "ppx_hash" "-j" "7" (CWD=/home/opam/.opam/4.14.1/.opam-switch/build/ppx_hash.v0.14.0)
-> compiled  ppx_hash.v0.14.0
Processing 142/191: [ppx_assert: dune build] [ppx_custom_printf: dune build] [ppx_sexp_message: dune build] [ppx_sexp_value: dune build]
-> installed ppx_hash.v0.14.0
Processing 143/191: [ppx_assert: dune build] [ppx_custom_printf: dune build] [ppx_sexp_message: dune build] [ppx_sexp_value: dune build]
Processing 144/191: [ppx_assert: dune build] [ppx_base: dune build] [ppx_custom_printf: dune build] [ppx_sexp_message: dune build] [ppx_sexp_value: dune build]
+ /home/opam/.opam/4.14.1/bin/dune "build" "-p" "ppx_assert" "-j" "7" (CWD=/home/opam/.opam/4.14.1/.opam-switch/build/ppx_assert.v0.14.0)
- (cd _build/default && /home/opam/.opam/4.14.1/bin/ocamlc.opt -w -40 -g -bin-annot -I runtime-lib/.ppx_assert_lib.objs/byte -I /home/opam/.opam/4.14.1/lib/base -I /home/opam/.opam/4.14.1/lib/base/base_internalhash_types -I /home/opam/.opam/4.14.1/lib/base/caml -I /home/opam/.opam/4.14.1/lib/base/shadow_stdlib -I /home/opam/.opam/4.14.1/lib/ppx_sexp_conv/runtime-lib -I /home/opam/.opam/4.14.1/lib/sexplib0 -intf-suffix .ml -no-alias-deps -open Ppx_assert_lib -o runtime-lib/.ppx_assert_lib.objs/byte/ppx_assert_lib__Runtime.cmo -c -impl runtime-lib/runtime.pp.ml)
- File "runtime-lib/runtime.ml", line 74, characters 46-51:
- 74 | let test_result_or_eq ~sexpifier ~comparator ?equal ~expect ~got =
-                                                    ^^^^^
- Warning 16 [unerasable-optional-argument]: this optional argument cannot be erased.
- File "runtime-lib/runtime.ml", line 102, characters 60-65:
- 102 | let test_result ~pos ~sexpifier ~comparator ~here ?message ?equal ~expect ~got =
-                                                                   ^^^^^
- Warning 16 [unerasable-optional-argument]: this optional argument cannot be erased.
- File "runtime-lib/runtime.ml", line 102, characters 51-58:
- 102 | let test_result ~pos ~sexpifier ~comparator ~here ?message ?equal ~expect ~got =
-                                                          ^^^^^^^
- Warning 16 [unerasable-optional-argument]: this optional argument cannot be erased.
- (cd _build/default && /home/opam/.opam/4.14.1/bin/ocamlopt.opt -w -40 -g -I runtime-lib/.ppx_assert_lib.objs/byte -I runtime-lib/.ppx_assert_lib.objs/native -I /home/opam/.opam/4.14.1/lib/base -I /home/opam/.opam/4.14.1/lib/base/base_internalhash_types -I /home/opam/.opam/4.14.1/lib/base/caml -I /home/opam/.opam/4.14.1/lib/base/shadow_stdlib -I /home/opam/.opam/4.14.1/lib/ppx_sexp_conv/runtime-lib -I /home/opam/.opam/4.14.1/lib/sexplib0 -intf-suffix .ml -no-alias-deps -open Ppx_assert_lib -o runtime-lib/.ppx_assert_lib.objs/native/ppx_assert_lib__Runtime.cmx -c -impl runtime-lib/runtime.pp.ml)
- File "runtime-lib/runtime.ml", line 74, characters 46-51:
- 74 | let test_result_or_eq ~sexpifier ~comparator ?equal ~expect ~got =
-                                                    ^^^^^
- Warning 16 [unerasable-optional-argument]: this optional argument cannot be erased.
- File "runtime-lib/runtime.ml", line 102, characters 60-65:
- 102 | let test_result ~pos ~sexpifier ~comparator ~here ?message ?equal ~expect ~got =
-                                                                   ^^^^^
- Warning 16 [unerasable-optional-argument]: this optional argument cannot be erased.
- File "runtime-lib/runtime.ml", line 102, characters 51-58:
- 102 | let test_result ~pos ~sexpifier ~comparator ~here ?message ?equal ~expect ~got =
-                                                          ^^^^^^^
- Warning 16 [unerasable-optional-argument]: this optional argument cannot be erased.
-> compiled  ppx_assert.v0.14.0
Processing 144/191: [ppx_base: dune build] [ppx_custom_printf: dune build] [ppx_sexp_message: dune build] [ppx_sexp_value: dune build]
-> installed ppx_assert.v0.14.0
Processing 145/191: [ppx_base: dune build] [ppx_custom_printf: dune build] [ppx_sexp_message: dune build] [ppx_sexp_value: dune build]
Processing 146/191: [jst-config: dune build] [ppx_base: dune build] [ppx_custom_printf: dune build] [ppx_sexp_message: dune build] [ppx_sexp_value: dune build]
+ /home/opam/.opam/4.14.1/bin/dune "build" "-p" "ppx_sexp_value" "-j" "7" (CWD=/home/opam/.opam/4.14.1/.opam-switch/build/ppx_sexp_value.v0.14.0)
-> compiled  ppx_sexp_value.v0.14.0
Processing 146/191: [jst-config: dune build] [ppx_base: dune build] [ppx_custom_printf: dune build] [ppx_sexp_message: dune build]
-> installed ppx_sexp_value.v0.14.0
Processing 147/191: [jst-config: dune build] [ppx_base: dune build] [ppx_custom_printf: dune build] [ppx_sexp_message: dune build]
+ /home/opam/.opam/4.14.1/bin/dune "build" "-p" "ppx_sexp_message" "-j" "7" (CWD=/home/opam/.opam/4.14.1/.opam-switch/build/ppx_sexp_message.v0.14.1)
-> compiled  ppx_sexp_message.v0.14.1
Processing 147/191: [jst-config: dune build] [ppx_base: dune build] [ppx_custom_printf: dune build]
-> installed ppx_sexp_message.v0.14.1
Processing 148/191: [jst-config: dune build] [ppx_base: dune build] [ppx_custom_printf: dune build]
+ /home/opam/.opam/4.14.1/bin/dune "build" "-p" "ppx_custom_printf" "-j" "7" (CWD=/home/opam/.opam/4.14.1/.opam-switch/build/ppx_custom_printf.v0.14.1)
-> compiled  ppx_custom_printf.v0.14.1
Processing 148/191: [jst-config: dune build] [ppx_base: dune build]
-> installed ppx_custom_printf.v0.14.1
Processing 149/191: [jst-config: dune build] [ppx_base: dune build]
Processing 150/191: [bin_prot: dune build] [jst-config: dune build] [ppx_base: dune build]
+ /home/opam/.opam/4.14.1/bin/dune "build" "-p" "ppx_base" "-j" "7" (CWD=/home/opam/.opam/4.14.1/.opam-switch/build/ppx_base.v0.14.0)
-> compiled  ppx_base.v0.14.0
Processing 150/191: [bin_prot: dune build] [jst-config: dune build]
-> installed ppx_base.v0.14.0
Processing 151/191: [bin_prot: dune build] [jst-config: dune build]
Processing 152/191: [bin_prot: dune build] [jst-config: dune build] [ppx_string: dune build]
+ /home/opam/.opam/4.14.1/bin/dune "build" "-p" "ppx_string" "-j" "7" (CWD=/home/opam/.opam/4.14.1/.opam-switch/build/ppx_string.v0.14.1)
-> compiled  ppx_string.v0.14.1
Processing 152/191: [bin_prot: dune build] [jst-config: dune build]
-> installed ppx_string.v0.14.1
Processing 153/191: [bin_prot: dune build] [jst-config: dune build]
+ /home/opam/.opam/4.14.1/bin/dune "build" "-p" "jst-config" "-j" "7" (CWD=/home/opam/.opam/4.14.1/.opam-switch/build/jst-config.v0.14.1)
-> compiled  jst-config.v0.14.1
Processing 153/191: [bin_prot: dune build]
-> installed jst-config.v0.14.1
Processing 154/191: [bin_prot: dune build]
Processing 155/191: [bin_prot: dune build] [time_now: dune build]
+ /home/opam/.opam/4.14.1/bin/dune "build" "-p" "bin_prot" "-j" "7" (CWD=/home/opam/.opam/4.14.1/.opam-switch/build/bin_prot.v0.14.1)
-> compiled  bin_prot.v0.14.1
Processing 155/191: [time_now: dune build]
-> installed bin_prot.v0.14.1
Processing 156/191: [time_now: dune build]
Processing 157/191: [ppx_bin_prot: dune build] [time_now: dune build]
+ /home/opam/.opam/4.14.1/bin/dune "build" "-p" "time_now" "-j" "7" (CWD=/home/opam/.opam/4.14.1/.opam-switch/build/time_now.v0.14.0)
-> compiled  time_now.v0.14.0
Processing 157/191: [ppx_bin_prot: dune build]
-> installed time_now.v0.14.0
Processing 158/191: [ppx_bin_prot: dune build]
Processing 159/191: [ppx_bin_prot: dune build] [ppx_inline_test: dune build]
Processing 160/191: [ppx_bin_prot: dune build] [ppx_inline_test: dune build] [ppx_module_timer: dune build]
+ /home/opam/.opam/4.14.1/bin/dune "build" "-p" "ppx_bin_prot" "-j" "7" (CWD=/home/opam/.opam/4.14.1/.opam-switch/build/ppx_bin_prot.v0.14.0)
-> compiled  ppx_bin_prot.v0.14.0
Processing 160/191: [ppx_inline_test: dune build] [ppx_module_timer: dune build]
-> installed ppx_bin_prot.v0.14.0
Processing 161/191: [ppx_inline_test: dune build] [ppx_module_timer: dune build]
+ /home/opam/.opam/4.14.1/bin/dune "build" "-p" "ppx_module_timer" "-j" "7" (CWD=/home/opam/.opam/4.14.1/.opam-switch/build/ppx_module_timer.v0.14.0)
-> compiled  ppx_module_timer.v0.14.0
Processing 161/191: [ppx_inline_test: dune build]
-> installed ppx_module_timer.v0.14.0
Processing 162/191: [ppx_inline_test: dune build]
+ /home/opam/.opam/4.14.1/bin/dune "build" "-p" "ppx_inline_test" "-j" "7" (CWD=/home/opam/.opam/4.14.1/.opam-switch/build/ppx_inline_test.v0.14.1)
-> compiled  ppx_inline_test.v0.14.1
-> installed ppx_inline_test.v0.14.1
Processing 164/191: [ppx_bench: dune build]
Processing 165/191: [ppx_bench: dune build] [ppx_expect: dune build]
+ /home/opam/.opam/4.14.1/bin/dune "build" "-p" "ppx_bench" "-j" "7" (CWD=/home/opam/.opam/4.14.1/.opam-switch/build/ppx_bench.v0.14.1)
-> compiled  ppx_bench.v0.14.1
Processing 165/191: [ppx_expect: dune build]
-> installed ppx_bench.v0.14.1
Processing 166/191: [ppx_expect: dune build]
Processing 167/191: [ppx_expect: dune build] [splittable_random: dune build]
+ /home/opam/.opam/4.14.1/bin/dune "build" "-p" "splittable_random" "-j" "7" (CWD=/home/opam/.opam/4.14.1/.opam-switch/build/splittable_random.v0.14.0)
-> compiled  splittable_random.v0.14.0
Processing 167/191: [ppx_expect: dune build]
-> installed splittable_random.v0.14.0
Processing 168/191: [ppx_expect: dune build]
Processing 169/191: [base_quickcheck: dune build] [ppx_expect: dune build]
+ /home/opam/.opam/4.14.1/bin/dune "build" "-p" "ppx_expect" "-j" "7" (CWD=/home/opam/.opam/4.14.1/.opam-switch/build/ppx_expect.v0.14.2)
-> compiled  ppx_expect.v0.14.2
Processing 169/191: [base_quickcheck: dune build]
-> installed ppx_expect.v0.14.2
Processing 170/191: [base_quickcheck: dune build]
+ /home/opam/.opam/4.14.1/bin/dune "build" "-p" "base_quickcheck" "-j" "7" (CWD=/home/opam/.opam/4.14.1/.opam-switch/build/base_quickcheck.v0.14.1)
-> compiled  base_quickcheck.v0.14.1
-> installed base_quickcheck.v0.14.1
Processing 172/191: [ppx_jane: dune build]
+ /home/opam/.opam/4.14.1/bin/dune "build" "-p" "ppx_jane" "-j" "7" (CWD=/home/opam/.opam/4.14.1/.opam-switch/build/ppx_jane.v0.14.0)
-> compiled  ppx_jane.v0.14.0
-> installed ppx_jane.v0.14.0
Processing 174/191: [base_bigstring: dune build]
+ /home/opam/.opam/4.14.1/bin/dune "build" "-p" "base_bigstring" "-j" "7" (CWD=/home/opam/.opam/4.14.1/.opam-switch/build/base_bigstring.v0.14.0)
-> compiled  base_bigstring.v0.14.0
-> installed base_bigstring.v0.14.0
Processing 176/191: [core_kernel: dune build]
+ /home/opam/.opam/4.14.1/bin/dune "build" "-p" "core_kernel" "-j" "7" (CWD=/home/opam/.opam/4.14.1/.opam-switch/build/core_kernel.v0.14.2)
- (cd _build/default/src && /usr/bin/cc -O2 -fno-strict-aliasing -fwrapv -pthread -fPIC -D_FILE_OFFSET_BITS=64 -O2 -fno-strict-aliasing -fwrapv -pthread -fPIC -D_LARGEFILE64_SOURCE -g -I /home/opam/.opam/4.14.1/lib/ocaml -I /home/opam/.opam/4.14.1/lib/base -I /home/opam/.opam/4.14.1/lib/base/base_internalhash_types -I /home/opam/.opam/4.14.1/lib/base/caml -I /home/opam/.opam/4.14.1/lib/base/md5 -I /home/opam/.opam/4.14.1/lib/base/shadow_stdlib -I /home/opam/.opam/4.14.1/lib/base_bigstring -I /home/opam/.opam/4.14.1/lib/base_quickcheck -I /home/opam/.opam/4.14.1/lib/bin_prot -I /home/opam/.opam/4.14.1/lib/bin_prot/shape -I /home/opam/.opam/4.14.1/lib/fieldslib -I /home/opam/.opam/4.14.1/lib/jane-street-headers -I /home/opam/.opam/4.14.1/lib/parsexp -I /home/opam/.opam/4.14.1/lib/ppx_assert/runtime-lib -I /home/opam/.opam/4.14.1/lib/ppx_bench/runtime-lib -I /home/opam/.opam/4.14.1/lib/ppx_compare/runtime-lib -I /home/opam/.opam/4.14.1/lib/ppx_enumerate/runtime-lib -I /home/opam/.opam/4.14.1/lib/ppx_expect/collector -I /home/opam/.opam/4.14.1/lib/ppx_expect/common -I /home/opam/.opam/4.14.1/lib/ppx_expect/config -I /home/opam/.opam/4.14.1/lib/ppx_expect/config_types -I /home/opam/.opam/4.14.1/lib/ppx_hash/runtime-lib -I /home/opam/.opam/4.14.1/lib/ppx_here/runtime-lib -I /home/opam/.opam/4.14.1/lib/ppx_inline_test/config -I /home/opam/.opam/4.14.1/lib/ppx_inline_test/runtime-lib -I /home/opam/.opam/4.14.1/lib/ppx_module_timer/runtime -I /home/opam/.opam/4.14.1/lib/ppx_sexp_conv/runtime-lib -I /home/opam/.opam/4.14.1/lib/sexplib -I /home/opam/.opam/4.14.1/lib/sexplib0 -I /home/opam/.opam/4.14.1/lib/splittable_random -I /home/opam/.opam/4.14.1/lib/stdio -I /home/opam/.opam/4.14.1/lib/time_now -I /home/opam/.opam/4.14.1/lib/typerep -I /home/opam/.opam/4.14.1/lib/variantslib -I ../base_for_tests/src -o md5_stubs.o -c md5_stubs.c)
- md5_stubs.c:11:32: warning: pragma diagnostic expected option name (e.g. "-Wundef") [-Wunknown-pragmas]
- #pragma GCC diagnostic ignored "-pedantic"
-                                ^
- 1 warning generated.
- (cd _build/default && /home/opam/.opam/4.14.1/bin/ocamlc.opt -w -40 -g -bin-annot -I src/.core_kernel.objs/byte -I /home/opam/.opam/4.14.1/lib/base -I /home/opam/.opam/4.14.1/lib/base/base_internalhash_types -I /home/opam/.opam/4.14.1/lib/base/caml -I /home/opam/.opam/4.14.1/lib/base/md5 -I /home/opam/.opam/4.14.1/lib/base/shadow_stdlib -I /home/opam/.opam/4.14.1/lib/base_bigstring -I /home/opam/.opam/4.14.1/lib/base_quickcheck -I /home/opam/.opam/4.14.1/lib/bin_prot -I /home/opam/.opam/4.14.1/lib/bin_prot/shape -I /home/opam/.opam/4.14.1/lib/fieldslib -I /home/opam/.opam/4.14.1/lib/jane-street-headers -I /home/opam/.opam/4.14.1/lib/parsexp -I /home/opam/.opam/4.14.1/lib/ppx_assert/runtime-lib -I /home/opam/.opam/4.14.1/lib/ppx_bench/runtime-lib -I /home/opam/.opam/4.14.1/lib/ppx_compare/runtime-lib -I /home/opam/.opam/4.14.1/lib/ppx_enumerate/runtime-lib -I /home/opam/.opam/4.14.1/lib/ppx_expect/collector -I /home/opam/.opam/4.14.1/lib/ppx_expect/common -I /home/opam/.opam/4.14.1/lib/ppx_expect/config -I /home/opam/.opam/4.14.1/lib/ppx_expect/config_types -I /home/opam/.opam/4.14.1/lib/ppx_hash/runtime-lib -I /home/opam/.opam/4.14.1/lib/ppx_here/runtime-lib -I /home/opam/.opam/4.14.1/lib/ppx_inline_test/config -I /home/opam/.opam/4.14.1/lib/ppx_inline_test/runtime-lib -I /home/opam/.opam/4.14.1/lib/ppx_module_timer/runtime -I /home/opam/.opam/4.14.1/lib/ppx_sexp_conv/runtime-lib -I /home/opam/.opam/4.14.1/lib/sexplib -I /home/opam/.opam/4.14.1/lib/sexplib0 -I /home/opam/.opam/4.14.1/lib/splittable_random -I /home/opam/.opam/4.14.1/lib/stdio -I /home/opam/.opam/4.14.1/lib/time_now -I /home/opam/.opam/4.14.1/lib/typerep -I /home/opam/.opam/4.14.1/lib/variantslib -I base_for_tests/src/.base_for_tests.objs/byte -intf-suffix .ml -no-alias-deps -open Core_kernel__ -o src/.core_kernel.objs/byte/core_kernel__Ephemeron.cmo -c -impl src/ephemeron.pp.ml)
- File "src/ephemeron.ml", line 7, characters 13-29:
- 7 | let create = Ephemeron.create
-                  ^^^^^^^^^^^^^^^^
- Alert old_ephemeron_api: Ephemeron.create
- This function won't be available in 5.0
- File "src/ephemeron.ml", line 10, characters 12-31:
- 10 |   | None -> Ephemeron.unset_key t
-                  ^^^^^^^^^^^^^^^^^^^
- Alert old_ephemeron_api: Ephemeron.unset_key
- This function won't be available in 5.0
- File "src/ephemeron.ml", line 11, characters 14-31:
- 11 |   | Some v -> Ephemeron.set_key t v
-                    ^^^^^^^^^^^^^^^^^
- Alert old_ephemeron_api: Ephemeron.set_key
- This function won't be available in 5.0
- File "src/ephemeron.ml", line 14, characters 14-31:
- 14 | let get_key = Ephemeron.get_key
-                    ^^^^^^^^^^^^^^^^^
- Alert old_ephemeron_api: Ephemeron.get_key
- This function won't be available in 5.0
- File "src/ephemeron.ml", line 17, characters 12-32:
- 17 |   | None -> Ephemeron.unset_data t
-                  ^^^^^^^^^^^^^^^^^^^^
- Alert old_ephemeron_api: Ephemeron.unset_data
- This function won't be available in 5.0
- File "src/ephemeron.ml", line 18, characters 14-32:
- 18 |   | Some v -> Ephemeron.set_data t v
-                    ^^^^^^^^^^^^^^^^^^
- Alert old_ephemeron_api: Ephemeron.set_data
- This function won't be available in 5.0
- File "src/ephemeron.ml", line 21, characters 15-33:
- 21 | let get_data = Ephemeron.get_data
-                     ^^^^^^^^^^^^^^^^^^
- Alert old_ephemeron_api: Ephemeron.get_data
- This function won't be available in 5.0
- File "src/ephemeron.ml", line 22, characters 20-39:
- 22 | let is_key_some t = Ephemeron.check_key t
-                          ^^^^^^^^^^^^^^^^^^^
- Alert old_ephemeron_api: Ephemeron.check_key
- This function won't be available in 5.0
- File "src/ephemeron.ml", line 24, characters 21-41:
- 24 | let is_data_some t = Ephemeron.check_data t
-                           ^^^^^^^^^^^^^^^^^^^^
- Alert old_ephemeron_api: Ephemeron.check_data
- This function won't be available in 5.0
- (cd _build/default && /home/opam/.opam/4.14.1/bin/ocamlopt.opt -w -40 -g -I src/.core_kernel.objs/byte -I src/.core_kernel.objs/native -I /home/opam/.opam/4.14.1/lib/base -I /home/opam/.opam/4.14.1/lib/base/base_internalhash_types -I /home/opam/.opam/4.14.1/lib/base/caml -I /home/opam/.opam/4.14.1/lib/base/md5 -I /home/opam/.opam/4.14.1/lib/base/shadow_stdlib -I /home/opam/.opam/4.14.1/lib/base_bigstring -I /home/opam/.opam/4.14.1/lib/base_quickcheck -I /home/opam/.opam/4.14.1/lib/bin_prot -I /home/opam/.opam/4.14.1/lib/bin_prot/shape -I /home/opam/.opam/4.14.1/lib/fieldslib -I /home/opam/.opam/4.14.1/lib/jane-street-headers -I /home/opam/.opam/4.14.1/lib/parsexp -I /home/opam/.opam/4.14.1/lib/ppx_assert/runtime-lib -I /home/opam/.opam/4.14.1/lib/ppx_bench/runtime-lib -I /home/opam/.opam/4.14.1/lib/ppx_compare/runtime-lib -I /home/opam/.opam/4.14.1/lib/ppx_enumerate/runtime-lib -I /home/opam/.opam/4.14.1/lib/ppx_expect/collector -I /home/opam/.opam/4.14.1/lib/ppx_expect/common -I /home/opam/.opam/4.14.1/lib/ppx_expect/config -I /home/opam/.opam/4.14.1/lib/ppx_expect/config_types -I /home/opam/.opam/4.14.1/lib/ppx_hash/runtime-lib -I /home/opam/.opam/4.14.1/lib/ppx_here/runtime-lib -I /home/opam/.opam/4.14.1/lib/ppx_inline_test/config -I /home/opam/.opam/4.14.1/lib/ppx_inline_test/runtime-lib -I /home/opam/.opam/4.14.1/lib/ppx_module_timer/runtime -I /home/opam/.opam/4.14.1/lib/ppx_sexp_conv/runtime-lib -I /home/opam/.opam/4.14.1/lib/sexplib -I /home/opam/.opam/4.14.1/lib/sexplib0 -I /home/opam/.opam/4.14.1/lib/splittable_random -I /home/opam/.opam/4.14.1/lib/stdio -I /home/opam/.opam/4.14.1/lib/time_now -I /home/opam/.opam/4.14.1/lib/typerep -I /home/opam/.opam/4.14.1/lib/variantslib -I base_for_tests/src/.base_for_tests.objs/byte -I base_for_tests/src/.base_for_tests.objs/native -intf-suffix .ml -no-alias-deps -open Core_kernel__ -o src/.core_kernel.objs/native/core_kernel__Ephemeron.cmx -c -impl src/ephemeron.pp.ml)
- File "src/ephemeron.ml", line 7, characters 13-29:
- 7 | let create = Ephemeron.create
-                  ^^^^^^^^^^^^^^^^
- Alert old_ephemeron_api: Ephemeron.create
- This function won't be available in 5.0
- File "src/ephemeron.ml", line 10, characters 12-31:
- 10 |   | None -> Ephemeron.unset_key t
-                  ^^^^^^^^^^^^^^^^^^^
- Alert old_ephemeron_api: Ephemeron.unset_key
- This function won't be available in 5.0
- File "src/ephemeron.ml", line 11, characters 14-31:
- 11 |   | Some v -> Ephemeron.set_key t v
-                    ^^^^^^^^^^^^^^^^^
- Alert old_ephemeron_api: Ephemeron.set_key
- This function won't be available in 5.0
- File "src/ephemeron.ml", line 14, characters 14-31:
- 14 | let get_key = Ephemeron.get_key
-                    ^^^^^^^^^^^^^^^^^
- Alert old_ephemeron_api: Ephemeron.get_key
- This function won't be available in 5.0
- File "src/ephemeron.ml", line 17, characters 12-32:
- 17 |   | None -> Ephemeron.unset_data t
-                  ^^^^^^^^^^^^^^^^^^^^
- Alert old_ephemeron_api: Ephemeron.unset_data
- This function won't be available in 5.0
- File "src/ephemeron.ml", line 18, characters 14-32:
- 18 |   | Some v -> Ephemeron.set_data t v
-                    ^^^^^^^^^^^^^^^^^^
- Alert old_ephemeron_api: Ephemeron.set_data
- This function won't be available in 5.0
- File "src/ephemeron.ml", line 21, characters 15-33:
- 21 | let get_data = Ephemeron.get_data
-                     ^^^^^^^^^^^^^^^^^^
- Alert old_ephemeron_api: Ephemeron.get_data
- This function won't be available in 5.0
- File "src/ephemeron.ml", line 22, characters 20-39:
- 22 | let is_key_some t = Ephemeron.check_key t
-                          ^^^^^^^^^^^^^^^^^^^
- Alert old_ephemeron_api: Ephemeron.check_key
- This function won't be available in 5.0
- File "src/ephemeron.ml", line 24, characters 21-41:
- 24 | let is_data_some t = Ephemeron.check_data t
-                           ^^^^^^^^^^^^^^^^^^^^
- Alert old_ephemeron_api: Ephemeron.check_data
- This function won't be available in 5.0
-> compiled  core_kernel.v0.14.2
-> installed core_kernel.v0.14.2
Processing 178/191: [re2: dune build]
Processing 179/191: [re2: dune build] [textutils_kernel: dune build]
Processing 180/191: [re2: dune build] [textutils_kernel: dune build] [timezone: dune build]
+ /home/opam/.opam/4.14.1/bin/dune "build" "-p" "textutils_kernel" "-j" "7" (CWD=/home/opam/.opam/4.14.1/.opam-switch/build/textutils_kernel.v0.14.0)
-> compiled  textutils_kernel.v0.14.0
Processing 180/191: [re2: dune build] [timezone: dune build]
-> installed textutils_kernel.v0.14.0
Processing 181/191: [re2: dune build] [timezone: dune build]
+ /home/opam/.opam/4.14.1/bin/dune "build" "-p" "timezone" "-j" "7" (CWD=/home/opam/.opam/4.14.1/.opam-switch/build/timezone.v0.14.0)
-> compiled  timezone.v0.14.0
Processing 181/191: [re2: dune build]
-> installed timezone.v0.14.0
Processing 182/191: [re2: dune build]
Processing 183/191: [core: dune build] [re2: dune build]
+ /home/opam/.opam/4.14.1/bin/dune "build" "-p" "core" "-j" "7" (CWD=/home/opam/.opam/4.14.1/.opam-switch/build/core.v0.14.1)
- (cd _build/default/src && /usr/bin/cc -O2 -fno-strict-aliasing -fwrapv -pthread -fPIC -D_FILE_OFFSET_BITS=64 -O2 -fno-strict-aliasing -fwrapv -pthread -fPIC -D_LARGEFILE64_SOURCE -g -I /home/opam/.opam/4.14.1/lib/ocaml -I /home/opam/.opam/4.14.1/lib/base -I /home/opam/.opam/4.14.1/lib/base/base_internalhash_types -I /home/opam/.opam/4.14.1/lib/base/caml -I /home/opam/.opam/4.14.1/lib/base/md5 -I /home/opam/.opam/4.14.1/lib/base/shadow_stdlib -I /home/opam/.opam/4.14.1/lib/base_bigstring -I /home/opam/.opam/4.14.1/lib/base_quickcheck -I /home/opam/.opam/4.14.1/lib/bin_prot -I /home/opam/.opam/4.14.1/lib/bin_prot/shape -I /home/opam/.opam/4.14.1/lib/core_kernel -I /home/opam/.opam/4.14.1/lib/core_kernel/base_for_tests -I /home/opam/.opam/4.14.1/lib/core_kernel/caml_unix -I /home/opam/.opam/4.14.1/lib/core_kernel/flags -I /home/opam/.opam/4.14.1/lib/core_kernel/version_util -I /home/opam/.opam/4.14.1/lib/fieldslib -I /home/opam/.opam/4.14.1/lib/jane-street-headers -I /home/opam/.opam/4.14.1/lib/ocaml/threads -I /home/opam/.opam/4.14.1/lib/parsexp -I /home/opam/.opam/4.14.1/lib/ppx_assert/runtime-lib -I /home/opam/.opam/4.14.1/lib/ppx_bench/runtime-lib -I /home/opam/.opam/4.14.1/lib/ppx_compare/runtime-lib -I /home/opam/.opam/4.14.1/lib/ppx_enumerate/runtime-lib -I /home/opam/.opam/4.14.1/lib/ppx_expect/collector -I /home/opam/.opam/4.14.1/lib/ppx_expect/common -I /home/opam/.opam/4.14.1/lib/ppx_expect/config -I /home/opam/.opam/4.14.1/lib/ppx_expect/config_types -I /home/opam/.opam/4.14.1/lib/ppx_hash/runtime-lib -I /home/opam/.opam/4.14.1/lib/ppx_here/runtime-lib -I /home/opam/.opam/4.14.1/lib/ppx_inline_test/config -I /home/opam/.opam/4.14.1/lib/ppx_inline_test/runtime-lib -I /home/opam/.opam/4.14.1/lib/ppx_module_timer/runtime -I /home/opam/.opam/4.14.1/lib/ppx_sexp_conv/runtime-lib -I /home/opam/.opam/4.14.1/lib/sexplib -I /home/opam/.opam/4.14.1/lib/sexplib/unix -I /home/opam/.opam/4.14.1/lib/sexplib0 -I /home/opam/.opam/4.14.1/lib/spawn -I /home/opam/.opam/4.14.1/lib/splittable_random -I /home/opam/.opam/4.14.1/lib/stdio -I /home/opam/.opam/4.14.1/lib/time_now -I /home/opam/.opam/4.14.1/lib/timezone -I /home/opam/.opam/4.14.1/lib/typerep -I /home/opam/.opam/4.14.1/lib/variantslib -I ../error_checking_mutex/src -o ocaml_utils_stubs.o -c ocaml_utils_stubs.c)
- In file included from ocaml_utils_stubs.c:17:
- ./ocaml_utils_macros.h:11:9: warning: 'Is_none' macro redefined [-Wmacro-redefined]
- #define Is_none(v) (Is_long(v) && Long_val(v) == 0)
-         ^
- /home/opam/.opam/4.14.1/lib/ocaml/caml/mlvalues.h:406:9: note: previous definition is here
- #define Is_none(v) ((v) == Val_none)
-         ^
- In file included from ocaml_utils_stubs.c:17:
- ./ocaml_utils_macros.h:12:9: warning: 'Is_some' macro redefined [-Wmacro-redefined]
- #define Is_some(v) (Is_block(v) && Tag_val(v) == 0 && Wosize_val(v) == 1)
-         ^
- /home/opam/.opam/4.14.1/lib/ocaml/caml/mlvalues.h:407:9: note: previous definition is here
- #define Is_some(v) Is_block(v)
-         ^
- 2 warnings generated.
- (cd _build/default/src && /usr/bin/cc -O2 -fno-strict-aliasing -fwrapv -pthread -fPIC -D_FILE_OFFSET_BITS=64 -O2 -fno-strict-aliasing -fwrapv -pthread -fPIC -D_LARGEFILE64_SOURCE -g -I /home/opam/.opam/4.14.1/lib/ocaml -I /home/opam/.opam/4.14.1/lib/base -I /home/opam/.opam/4.14.1/lib/base/base_internalhash_types -I /home/opam/.opam/4.14.1/lib/base/caml -I /home/opam/.opam/4.14.1/lib/base/md5 -I /home/opam/.opam/4.14.1/lib/base/shadow_stdlib -I /home/opam/.opam/4.14.1/lib/base_bigstring -I /home/opam/.opam/4.14.1/lib/base_quickcheck -I /home/opam/.opam/4.14.1/lib/bin_prot -I /home/opam/.opam/4.14.1/lib/bin_prot/shape -I /home/opam/.opam/4.14.1/lib/core_kernel -I /home/opam/.opam/4.14.1/lib/core_kernel/base_for_tests -I /home/opam/.opam/4.14.1/lib/core_kernel/caml_unix -I /home/opam/.opam/4.14.1/lib/core_kernel/flags -I /home/opam/.opam/4.14.1/lib/core_kernel/version_util -I /home/opam/.opam/4.14.1/lib/fieldslib -I /home/opam/.opam/4.14.1/lib/jane-street-headers -I /home/opam/.opam/4.14.1/lib/ocaml/threads -I /home/opam/.opam/4.14.1/lib/parsexp -I /home/opam/.opam/4.14.1/lib/ppx_assert/runtime-lib -I /home/opam/.opam/4.14.1/lib/ppx_bench/runtime-lib -I /home/opam/.opam/4.14.1/lib/ppx_compare/runtime-lib -I /home/opam/.opam/4.14.1/lib/ppx_enumerate/runtime-lib -I /home/opam/.opam/4.14.1/lib/ppx_expect/collector -I /home/opam/.opam/4.14.1/lib/ppx_expect/common -I /home/opam/.opam/4.14.1/lib/ppx_expect/config -I /home/opam/.opam/4.14.1/lib/ppx_expect/config_types -I /home/opam/.opam/4.14.1/lib/ppx_hash/runtime-lib -I /home/opam/.opam/4.14.1/lib/ppx_here/runtime-lib -I /home/opam/.opam/4.14.1/lib/ppx_inline_test/config -I /home/opam/.opam/4.14.1/lib/ppx_inline_test/runtime-lib -I /home/opam/.opam/4.14.1/lib/ppx_module_timer/runtime -I /home/opam/.opam/4.14.1/lib/ppx_sexp_conv/runtime-lib -I /home/opam/.opam/4.14.1/lib/sexplib -I /home/opam/.opam/4.14.1/lib/sexplib/unix -I /home/opam/.opam/4.14.1/lib/sexplib0 -I /home/opam/.opam/4.14.1/lib/spawn -I /home/opam/.opam/4.14.1/lib/splittable_random -I /home/opam/.opam/4.14.1/lib/stdio -I /home/opam/.opam/4.14.1/lib/time_now -I /home/opam/.opam/4.14.1/lib/timezone -I /home/opam/.opam/4.14.1/lib/typerep -I /home/opam/.opam/4.14.1/lib/variantslib -I ../error_checking_mutex/src -o unix_stubs.o -c unix_stubs.c)
- unix_stubs.c:349:2: warning: "_POSIX_SYNCHRONIZED_IO undefined or <= 0; aliasing unix_fdatasync to unix_fsync" [-W#warnings]
- #warning "_POSIX_SYNCHRONIZED_IO undefined or <= 0; aliasing unix_fdatasync to unix_fsync"
-  ^
- unix_stubs.c:859:9: warning: initializing 'char *' with an expression of type 'const char *' discards qualifiers [-Wincompatible-pointer-types-discards-qualifiers]
-   char *path = String_val(v_path);
-         ^      ~~~~~~~~~~~~~~~~~~
- unix_stubs.c:1282:2: warning: "_POSIX_PRIORITY_SCHEDULING not present; sched_setscheduler undefined" [-W#warnings]
- #warning "_POSIX_PRIORITY_SCHEDULING not present; sched_setscheduler undefined"
-  ^
- unix_stubs.c:1285:4: warning: "invalid_argument" is deprecated: use "caml_invalid_argument" instead [-W#pragma-messages]
- {  invalid_argument("sched_setscheduler unimplemented"); }
-    ^
- /home/opam/.opam/4.14.1/lib/ocaml/caml/compatibility.h:112:26: note: expanded from macro 'invalid_argument'
- #define invalid_argument CAML_DEPRECATED("invalid_argument", "caml_invalid_argument") caml_invalid_argument
-                          ^
- /home/opam/.opam/4.14.1/lib/ocaml/caml/misc.h:58:3: note: expanded from macro 'CAML_DEPRECATED'
-   CAML_PREPROWARNING(name1 is deprecated: use name2 instead)
-   ^
- /home/opam/.opam/4.14.1/lib/ocaml/caml/misc.h:56:31: note: expanded from macro 'CAML_PREPROWARNING'
- #define CAML_PREPROWARNING(x) _Pragma(CAML_MAKEWARNING2(x))
-                               ^
- <scratch space>:70:6: note: expanded from here
-  GCC warning "\"invalid_argument\" is deprecated: use \"caml_invalid_argument\" instead"
-      ^
- 4 warnings generated.
- (cd _build/default && /home/opam/.opam/4.14.1/bin/ocamlc.opt -w -40 -g -bin-annot -I src/.core.objs/byte -I /home/opam/.opam/4.14.1/lib/base -I /home/opam/.opam/4.14.1/lib/base/base_internalhash_types -I /home/opam/.opam/4.14.1/lib/base/caml -I /home/opam/.opam/4.14.1/lib/base/md5 -I /home/opam/.opam/4.14.1/lib/base/shadow_stdlib -I /home/opam/.opam/4.14.1/lib/base_bigstring -I /home/opam/.opam/4.14.1/lib/base_quickcheck -I /home/opam/.opam/4.14.1/lib/bin_prot -I /home/opam/.opam/4.14.1/lib/bin_prot/shape -I /home/opam/.opam/4.14.1/lib/core_kernel -I /home/opam/.opam/4.14.1/lib/core_kernel/base_for_tests -I /home/opam/.opam/4.14.1/lib/core_kernel/caml_unix -I /home/opam/.opam/4.14.1/lib/core_kernel/flags -I /home/opam/.opam/4.14.1/lib/core_kernel/version_util -I /home/opam/.opam/4.14.1/lib/fieldslib -I /home/opam/.opam/4.14.1/lib/jane-street-headers -I /home/opam/.opam/4.14.1/lib/ocaml/threads -I /home/opam/.opam/4.14.1/lib/parsexp -I /home/opam/.opam/4.14.1/lib/ppx_assert/runtime-lib -I /home/opam/.opam/4.14.1/lib/ppx_bench/runtime-lib -I /home/opam/.opam/4.14.1/lib/ppx_compare/runtime-lib -I /home/opam/.opam/4.14.1/lib/ppx_enumerate/runtime-lib -I /home/opam/.opam/4.14.1/lib/ppx_expect/collector -I /home/opam/.opam/4.14.1/lib/ppx_expect/common -I /home/opam/.opam/4.14.1/lib/ppx_expect/config -I /home/opam/.opam/4.14.1/lib/ppx_expect/config_types -I /home/opam/.opam/4.14.1/lib/ppx_hash/runtime-lib -I /home/opam/.opam/4.14.1/lib/ppx_here/runtime-lib -I /home/opam/.opam/4.14.1/lib/ppx_inline_test/config -I /home/opam/.opam/4.14.1/lib/ppx_inline_test/runtime-lib -I /home/opam/.opam/4.14.1/lib/ppx_module_timer/runtime -I /home/opam/.opam/4.14.1/lib/ppx_sexp_conv/runtime-lib -I /home/opam/.opam/4.14.1/lib/sexplib -I /home/opam/.opam/4.14.1/lib/sexplib/unix -I /home/opam/.opam/4.14.1/lib/sexplib0 -I /home/opam/.opam/4.14.1/lib/spawn -I /home/opam/.opam/4.14.1/lib/splittable_random -I /home/opam/.opam/4.14.1/lib/stdio -I /home/opam/.opam/4.14.1/lib/time_now -I /home/opam/.opam/4.14.1/lib/timezone -I /home/opam/.opam/4.14.1/lib/typerep -I /home/opam/.opam/4.14.1/lib/variantslib -I error_checking_mutex/src/.error_checking_mutex.objs/byte -intf-suffix .ml -no-alias-deps -open Core__ -o src/.core.objs/byte/core__Core_thread.cmo -c -impl src/core_thread.pp.ml)
- File "src/core_thread.pp.ml", line 1:
- Alert deprecated: wait_read
- This function no longer does anything
- File "thread.mli", lines 90-91, characters 0-62:
-   Definition
- File "src/core_thread.mli", line 61, characters 0-39:
-   Expected signature
- File "src/core_thread.pp.ml", line 1:
- Alert deprecated: wait_write
- This function no longer does anything
- File "thread.mli", lines 95-96, characters 0-62:
-   Definition
- File "src/core_thread.mli", line 64, characters 0-40:
-   Expected signature
- (cd _build/default && /home/opam/.opam/4.14.1/bin/ocamlopt.opt -w -40 -g -I src/.core.objs/byte -I src/.core.objs/native -I /home/opam/.opam/4.14.1/lib/base -I /home/opam/.opam/4.14.1/lib/base/base_internalhash_types -I /home/opam/.opam/4.14.1/lib/base/caml -I /home/opam/.opam/4.14.1/lib/base/md5 -I /home/opam/.opam/4.14.1/lib/base/shadow_stdlib -I /home/opam/.opam/4.14.1/lib/base_bigstring -I /home/opam/.opam/4.14.1/lib/base_quickcheck -I /home/opam/.opam/4.14.1/lib/bin_prot -I /home/opam/.opam/4.14.1/lib/bin_prot/shape -I /home/opam/.opam/4.14.1/lib/core_kernel -I /home/opam/.opam/4.14.1/lib/core_kernel/base_for_tests -I /home/opam/.opam/4.14.1/lib/core_kernel/caml_unix -I /home/opam/.opam/4.14.1/lib/core_kernel/flags -I /home/opam/.opam/4.14.1/lib/core_kernel/version_util -I /home/opam/.opam/4.14.1/lib/fieldslib -I /home/opam/.opam/4.14.1/lib/jane-street-headers -I /home/opam/.opam/4.14.1/lib/ocaml/threads -I /home/opam/.opam/4.14.1/lib/parsexp -I /home/opam/.opam/4.14.1/lib/ppx_assert/runtime-lib -I /home/opam/.opam/4.14.1/lib/ppx_bench/runtime-lib -I /home/opam/.opam/4.14.1/lib/ppx_compare/runtime-lib -I /home/opam/.opam/4.14.1/lib/ppx_enumerate/runtime-lib -I /home/opam/.opam/4.14.1/lib/ppx_expect/collector -I /home/opam/.opam/4.14.1/lib/ppx_expect/common -I /home/opam/.opam/4.14.1/lib/ppx_expect/config -I /home/opam/.opam/4.14.1/lib/ppx_expect/config_types -I /home/opam/.opam/4.14.1/lib/ppx_hash/runtime-lib -I /home/opam/.opam/4.14.1/lib/ppx_here/runtime-lib -I /home/opam/.opam/4.14.1/lib/ppx_inline_test/config -I /home/opam/.opam/4.14.1/lib/ppx_inline_test/runtime-lib -I /home/opam/.opam/4.14.1/lib/ppx_module_timer/runtime -I /home/opam/.opam/4.14.1/lib/ppx_sexp_conv/runtime-lib -I /home/opam/.opam/4.14.1/lib/sexplib -I /home/opam/.opam/4.14.1/lib/sexplib/unix -I /home/opam/.opam/4.14.1/lib/sexplib0 -I /home/opam/.opam/4.14.1/lib/spawn -I /home/opam/.opam/4.14.1/lib/splittable_random -I /home/opam/.opam/4.14.1/lib/stdio -I /home/opam/.opam/4.14.1/lib/time_now -I /home/opam/.opam/4.14.1/lib/timezone -I /home/opam/.opam/4.14.1/lib/typerep -I /home/opam/.opam/4.14.1/lib/variantslib -I error_checking_mutex/src/.error_checking_mutex.objs/byte -I error_checking_mutex/src/.error_checking_mutex.objs/native -intf-suffix .ml -no-alias-deps -open Core__ -o src/.core.objs/native/core__Core_thread.cmx -c -impl src/core_thread.pp.ml)
- File "src/core_thread.pp.ml", line 1:
- Alert deprecated: wait_read
- This function no longer does anything
- File "thread.mli", lines 90-91, characters 0-62:
-   Definition
- File "src/core_thread.mli", line 61, characters 0-39:
-   Expected signature
- File "src/core_thread.pp.ml", line 1:
- Alert deprecated: wait_write
- This function no longer does anything
- File "thread.mli", lines 95-96, characters 0-62:
-   Definition
- File "src/core_thread.mli", line 64, characters 0-40:
-   Expected signature
-> compiled  core.v0.14.1
Processing 183/191: [re2: dune build]
-> installed core.v0.14.1
Processing 184/191: [re2: dune build]
Processing 185/191: [re2: dune build] [textutils: dune build]
+ /home/opam/.opam/4.14.1/bin/dune "build" "-p" "textutils" "-j" "7" (CWD=/home/opam/.opam/4.14.1/.opam-switch/build/textutils.v0.14.0)
-> compiled  textutils.v0.14.0
Processing 185/191: [re2: dune build]
-> installed textutils.v0.14.0
Processing 186/191: [re2: dune build]
Processing 187/191: [re2: dune build] [shell: dune build]
+ /home/opam/.opam/4.14.1/bin/dune "build" "-p" "shell" "-j" "7" (CWD=/home/opam/.opam/4.14.1/.opam-switch/build/shell.v0.14.0)
-> compiled  shell.v0.14.0
Processing 187/191: [re2: dune build]
-> installed shell.v0.14.0
Processing 188/191: [re2: dune build]
+ /home/opam/.opam/4.14.1/bin/dune "build" "-p" "re2" "-j" "7" (CWD=/home/opam/.opam/4.14.1/.opam-switch/build/re2.v0.14.0)
- (cd _build/default/src && /usr/bin/cc -O2 -fno-strict-aliasing -fwrapv -pthread -fPIC -I re2_c/libre2 -g -I /home/opam/.opam/4.14.1/lib/ocaml -I /home/opam/.opam/4.14.1/lib/base -I /home/opam/.opam/4.14.1/lib/base/base_internalhash_types -I /home/opam/.opam/4.14.1/lib/base/caml -I /home/opam/.opam/4.14.1/lib/base/md5 -I /home/opam/.opam/4.14.1/lib/base/shadow_stdlib -I /home/opam/.opam/4.14.1/lib/base_bigstring -I /home/opam/.opam/4.14.1/lib/base_quickcheck -I /home/opam/.opam/4.14.1/lib/bin_prot -I /home/opam/.opam/4.14.1/lib/bin_prot/shape -I /home/opam/.opam/4.14.1/lib/core_kernel -I /home/opam/.opam/4.14.1/lib/core_kernel/base_for_tests -I /home/opam/.opam/4.14.1/lib/core_kernel/rope -I /home/opam/.opam/4.14.1/lib/fieldslib -I /home/opam/.opam/4.14.1/lib/jane-street-headers -I /home/opam/.opam/4.14.1/lib/parsexp -I /home/opam/.opam/4.14.1/lib/ppx_assert/runtime-lib -I /home/opam/.opam/4.14.1/lib/ppx_bench/runtime-lib -I /home/opam/.opam/4.14.1/lib/ppx_compare/runtime-lib -I /home/opam/.opam/4.14.1/lib/ppx_enumerate/runtime-lib -I /home/opam/.opam/4.14.1/lib/ppx_expect/collector -I /home/opam/.opam/4.14.1/lib/ppx_expect/common -I /home/opam/.opam/4.14.1/lib/ppx_expect/config -I /home/opam/.opam/4.14.1/lib/ppx_expect/config_types -I /home/opam/.opam/4.14.1/lib/ppx_hash/runtime-lib -I /home/opam/.opam/4.14.1/lib/ppx_here/runtime-lib -I /home/opam/.opam/4.14.1/lib/ppx_inline_test/config -I /home/opam/.opam/4.14.1/lib/ppx_inline_test/runtime-lib -I /home/opam/.opam/4.14.1/lib/ppx_module_timer/runtime -I /home/opam/.opam/4.14.1/lib/ppx_sexp_conv/runtime-lib -I /home/opam/.opam/4.14.1/lib/sexplib -I /home/opam/.opam/4.14.1/lib/sexplib0 -I /home/opam/.opam/4.14.1/lib/splittable_random -I /home/opam/.opam/4.14.1/lib/stdio -I /home/opam/.opam/4.14.1/lib/time_now -I /home/opam/.opam/4.14.1/lib/typerep -I /home/opam/.opam/4.14.1/lib/variantslib -I re2_c -o stubs.o -c stubs.cpp)
- In file included from stubs.cpp:64:
- ./util.h:6:9: warning: 'Val_none' macro redefined [-Wmacro-redefined]
- #define Val_none (Val_int(0))
-         ^
- /home/opam/.opam/4.14.1/lib/ocaml/caml/mlvalues.h:403:9: note: previous definition is here
- #define Val_none Val_int(0)
-         ^
- 1 warning generated.
- (cd _build/default && /home/opam/.opam/4.14.1/bin/ocamlc.opt -w -40 -g -bin-annot -I src/.re2.objs/byte -I /home/opam/.opam/4.14.1/lib/base -I /home/opam/.opam/4.14.1/lib/base/base_internalhash_types -I /home/opam/.opam/4.14.1/lib/base/caml -I /home/opam/.opam/4.14.1/lib/base/md5 -I /home/opam/.opam/4.14.1/lib/base/shadow_stdlib -I /home/opam/.opam/4.14.1/lib/base_bigstring -I /home/opam/.opam/4.14.1/lib/base_quickcheck -I /home/opam/.opam/4.14.1/lib/bin_prot -I /home/opam/.opam/4.14.1/lib/bin_prot/shape -I /home/opam/.opam/4.14.1/lib/core_kernel -I /home/opam/.opam/4.14.1/lib/core_kernel/base_for_tests -I /home/opam/.opam/4.14.1/lib/core_kernel/rope -I /home/opam/.opam/4.14.1/lib/fieldslib -I /home/opam/.opam/4.14.1/lib/jane-street-headers -I /home/opam/.opam/4.14.1/lib/parsexp -I /home/opam/.opam/4.14.1/lib/ppx_assert/runtime-lib -I /home/opam/.opam/4.14.1/lib/ppx_bench/runtime-lib -I /home/opam/.opam/4.14.1/lib/ppx_compare/runtime-lib -I /home/opam/.opam/4.14.1/lib/ppx_enumerate/runtime-lib -I /home/opam/.opam/4.14.1/lib/ppx_expect/collector -I /home/opam/.opam/4.14.1/lib/ppx_expect/common -I /home/opam/.opam/4.14.1/lib/ppx_expect/config -I /home/opam/.opam/4.14.1/lib/ppx_expect/config_types -I /home/opam/.opam/4.14.1/lib/ppx_hash/runtime-lib -I /home/opam/.opam/4.14.1/lib/ppx_here/runtime-lib -I /home/opam/.opam/4.14.1/lib/ppx_inline_test/config -I /home/opam/.opam/4.14.1/lib/ppx_inline_test/runtime-lib -I /home/opam/.opam/4.14.1/lib/ppx_module_timer/runtime -I /home/opam/.opam/4.14.1/lib/ppx_sexp_conv/runtime-lib -I /home/opam/.opam/4.14.1/lib/sexplib -I /home/opam/.opam/4.14.1/lib/sexplib0 -I /home/opam/.opam/4.14.1/lib/splittable_random -I /home/opam/.opam/4.14.1/lib/stdio -I /home/opam/.opam/4.14.1/lib/time_now -I /home/opam/.opam/4.14.1/lib/typerep -I /home/opam/.opam/4.14.1/lib/variantslib -I src/re2_c/.re2_c.objs/byte -intf-suffix .ml -no-alias-deps -open Re2__ -o src/.re2.objs/byte/re2__Regex.cmo -c -impl src/regex.pp.ml)
- File "src/regex.ml", line 156, characters 25-46:
- 156 |       | Invalid_argument "index out of bounds" ->
-                                ^^^^^^^^^^^^^^^^^^^^^
- Warning 52 [fragile-literal-pattern]: Code should not depend on the actual values of
- this constructor's arguments. They are only for information
- and may change in future versions. (See manual section 11.5)
- (cd _build/default && /home/opam/.opam/4.14.1/bin/ocamlopt.opt -w -40 -g -I src/.re2.objs/byte -I src/.re2.objs/native -I /home/opam/.opam/4.14.1/lib/base -I /home/opam/.opam/4.14.1/lib/base/base_internalhash_types -I /home/opam/.opam/4.14.1/lib/base/caml -I /home/opam/.opam/4.14.1/lib/base/md5 -I /home/opam/.opam/4.14.1/lib/base/shadow_stdlib -I /home/opam/.opam/4.14.1/lib/base_bigstring -I /home/opam/.opam/4.14.1/lib/base_quickcheck -I /home/opam/.opam/4.14.1/lib/bin_prot -I /home/opam/.opam/4.14.1/lib/bin_prot/shape -I /home/opam/.opam/4.14.1/lib/core_kernel -I /home/opam/.opam/4.14.1/lib/core_kernel/base_for_tests -I /home/opam/.opam/4.14.1/lib/core_kernel/rope -I /home/opam/.opam/4.14.1/lib/fieldslib -I /home/opam/.opam/4.14.1/lib/jane-street-headers -I /home/opam/.opam/4.14.1/lib/parsexp -I /home/opam/.opam/4.14.1/lib/ppx_assert/runtime-lib -I /home/opam/.opam/4.14.1/lib/ppx_bench/runtime-lib -I /home/opam/.opam/4.14.1/lib/ppx_compare/runtime-lib -I /home/opam/.opam/4.14.1/lib/ppx_enumerate/runtime-lib -I /home/opam/.opam/4.14.1/lib/ppx_expect/collector -I /home/opam/.opam/4.14.1/lib/ppx_expect/common -I /home/opam/.opam/4.14.1/lib/ppx_expect/config -I /home/opam/.opam/4.14.1/lib/ppx_expect/config_types -I /home/opam/.opam/4.14.1/lib/ppx_hash/runtime-lib -I /home/opam/.opam/4.14.1/lib/ppx_here/runtime-lib -I /home/opam/.opam/4.14.1/lib/ppx_inline_test/config -I /home/opam/.opam/4.14.1/lib/ppx_inline_test/runtime-lib -I /home/opam/.opam/4.14.1/lib/ppx_module_timer/runtime -I /home/opam/.opam/4.14.1/lib/ppx_sexp_conv/runtime-lib -I /home/opam/.opam/4.14.1/lib/sexplib -I /home/opam/.opam/4.14.1/lib/sexplib0 -I /home/opam/.opam/4.14.1/lib/splittable_random -I /home/opam/.opam/4.14.1/lib/stdio -I /home/opam/.opam/4.14.1/lib/time_now -I /home/opam/.opam/4.14.1/lib/typerep -I /home/opam/.opam/4.14.1/lib/variantslib -I src/re2_c/.re2_c.objs/byte -I src/re2_c/.re2_c.objs/native -intf-suffix .ml -no-alias-deps -open Re2__ -o src/.re2.objs/native/re2__Regex.cmx -c -impl src/regex.pp.ml)
- File "src/regex.ml", line 156, characters 25-46:
- 156 |       | Invalid_argument "index out of bounds" ->
-                                ^^^^^^^^^^^^^^^^^^^^^
- Warning 52 [fragile-literal-pattern]: Code should not depend on the actual values of
- this constructor's arguments. They are only for information
- and may change in future versions. (See manual section 11.5)
- (cd _build/default/src/re2_c && /usr/local/bin/bash -e -u -o pipefail -c '
- ARFLAGS=rsc
- CXXFLAGS="-Wall -O3 -g -pthread"
- if [ FreeBSD = `uname -s` ]; then
-        CXX=clang++
-        CXXFLAGS="$CXXFLAGS -I /usr/local/lib/re2"
- else
-        CXX=g++
- fi
- if ! true; then
-   CXX="$CXX -m32"
- fi
- /usr/local/bin/gmake -s -C libre2 clean
- /usr/local/bin/gmake -s -C libre2 ARFLAGS="$ARFLAGS" CXX="$CXX" CXXFLAGS="$CXXFLAGS" obj/libre2.a obj/so/libre2.so
- cp libre2/obj/libre2.a libre2_c_stubs.a
- cp libre2/obj/so/libre2.so dllre2_c_stubs.so
- /usr/local/bin/gmake -s -C libre2 clean
- ')
- ld: warning: version script assignment of 'global' to symbol '_ZlsRSoRKN3re211StringPieceE' failed: symbol not defined
-> compiled  re2.v0.14.0
-> installed re2.v0.14.0
Processing 190/191: [core_profiler: dune build]
+ /home/opam/.opam/4.14.1/bin/dune "build" "-p" "core_profiler" "-j" "7" (CWD=/home/opam/.opam/4.14.1/.opam-switch/build/core_profiler.v0.14.0)
- File "offline_tool/bin/dune", line 1, characters 33-46:
- 1 | (executables (names dump_metrics profiler_tool)
-                                      ^^^^^^^^^^^^^
- (cd _build/default && /home/opam/.opam/4.14.1/bin/ocamlopt.opt -w -40 -g -o offline_tool/bin/profiler_tool.exe /home/opam/.opam/4.14.1/lib/base/base_internalhash_types/base_internalhash_types.cmxa -I /home/opam/.opam/4.14.1/lib/base/base_internalhash_types /home/opam/.opam/4.14.1/lib/base/caml/caml.cmxa /home/opam/.opam/4.14.1/lib/sexplib0/sexplib0.cmxa /home/opam/.opam/4.14.1/lib/base/shadow_stdlib/shadow_stdlib.cmxa /home/opam/.opam/4.14.1/lib/base/base.cmxa -I /home/opam/.opam/4.14.1/lib/base /home/opam/.opam/4.14.1/lib/ppx_sexp_conv/runtime-lib/ppx_sexp_conv_lib.cmxa /home/opam/.opam/4.14.1/lib/ppx_compare/runtime-lib/ppx_compare_lib.cmxa /home/opam/.opam/4.14.1/lib/ppx_enumerate/runtime-lib/ppx_enumerate_lib.cmxa /home/opam/.opam/4.14.1/lib/ppx_hash/runtime-lib/ppx_hash_lib.cmxa /home/opam/.opam/4.14.1/lib/ppx_here/runtime-lib/ppx_here_lib.cmxa /home/opam/.opam/4.14.1/lib/ppx_assert/runtime-lib/ppx_assert_lib.cmxa /home/opam/.opam/4.14.1/lib/ppx_bench/runtime-lib/ppx_bench_lib.cmxa /home/opam/.opam/4.14.1/lib/base/md5/md5_lib.cmxa /home/opam/.opam/4.14.1/lib/fieldslib/fieldslib.cmxa /home/opam/.opam/4.14.1/lib/variantslib/variantslib.cmxa /home/opam/.opam/4.14.1/lib/bin_prot/shape/bin_shape_lib.cmxa /home/opam/.opam/4.14.1/lib/bin_prot/bin_prot.cmxa -I /home/opam/.opam/4.14.1/lib/bin_prot /home/opam/.opam/4.14.1/lib/ppx_inline_test/config/inline_test_config.cmxa /home/opam/.opam/4.14.1/lib/jane-street-headers/jane_street_headers.cmxa /home/opam/.opam/4.14.1/lib/time_now/time_now.cmxa -I /home/opam/.opam/4.14.1/lib/time_now /home/opam/.opam/4.14.1/lib/ppx_inline_test/runtime-lib/ppx_inline_test_lib.cmxa /home/opam/.opam/4.14.1/lib/stdio/stdio.cmxa /home/opam/.opam/4.14.1/lib/ppx_module_timer/runtime/ppx_module_timer_runtime.cmxa /home/opam/.opam/4.14.1/lib/typerep/typerep_lib.cmxa /home/opam/.opam/4.14.1/lib/ppx_expect/common/expect_test_common.cmxa /home/opam/.opam/4.14.1/lib/ppx_expect/config_types/expect_test_config_types.cmxa /home/opam/.opam/4.14.1/lib/ppx_expect/collector/expect_test_collector.cmxa -I /home/opam/.opam/4.14.1/lib/ppx_expect/collector /home/opam/.opam/4.14.1/lib/ppx_expect/config/expect_test_config.cmxa /home/opam/.opam/4.14.1/lib/splittable_random/splittable_random.cmxa /home/opam/.opam/4.14.1/lib/base_quickcheck/base_quickcheck.cmxa /home/opam/.opam/4.14.1/lib/base_bigstring/base_bigstring.cmxa -I /home/opam/.opam/4.14.1/lib/base_bigstring /home/opam/.opam/4.14.1/lib/core_kernel/base_for_tests/base_for_tests.cmxa /home/opam/.opam/4.14.1/lib/ocaml/unix.cmxa -I /home/opam/.opam/4.14.1/lib/ocaml /home/opam/.opam/4.14.1/lib/ocaml/bigarray.cmxa -I /home/opam/.opam/4.14.1/lib/ocaml /home/opam/.opam/4.14.1/lib/parsexp/parsexp.cmxa /home/opam/.opam/4.14.1/lib/sexplib/sexplib.cmxa /home/opam/.opam/4.14.1/lib/core_kernel/core_kernel.cmxa -I /home/opam/.opam/4.14.1/lib/core_kernel /home/opam/.opam/4.14.1/lib/core_kernel/ansi_kernel/ansi_kernel.cmxa /home/opam/.opam/4.14.1/lib/ocaml/threads/threads.cmxa -I /home/opam/.opam/4.14.1/lib/ocaml /home/opam/.opam/4.14.1/lib/core/error_checking_mutex/error_checking_mutex.cmxa -I /home/opam/.opam/4.14.1/lib/core/error_checking_mutex /home/opam/.opam/4.14.1/lib/core_kernel/caml_unix/caml_unix.cmxa /home/opam/.opam/4.14.1/lib/core_kernel/flags/flags.cmxa /home/opam/.opam/4.14.1/lib/core_kernel/version_util/version_util.cmxa -I /home/opam/.opam/4.14.1/lib/core_kernel/version_util /home/opam/.opam/4.14.1/lib/sexplib/unix/sexplib_unix.cmxa /home/opam/.opam/4.14.1/lib/spawn/spawn.cmxa -I /home/opam/.opam/4.14.1/lib/spawn /home/opam/.opam/4.14.1/lib/timezone/timezone.cmxa /home/opam/.opam/4.14.1/lib/core/core.cmxa -I /home/opam/.opam/4.14.1/lib/core /home/opam/.opam/4.14.1/lib/core_kernel/bounded_int_table/bounded_int_table.cmxa /home/opam/.opam/4.14.1/lib/core/linux_ext/linux_ext.cmxa -I /home/opam/.opam/4.14.1/lib/core/linux_ext /home/opam/.opam/4.14.1/lib/textutils/console/console.cmxa /home/opam/.opam/4.14.1/lib/textutils/ascii_table_kernel/ascii_table_kernel.cmxa /home/opam/.opam/4.14.1/lib/textutils/ascii_table/ascii_table.cmxa /home/opam/.opam/4.14.1/lib/core/bigstring_unix/bigstring_unix.cmxa -I /home/opam/.opam/4.14.1/lib/core/bigstring_unix disabled_lib/core_profiler_disabled.cmxa /home/opam/.opam/4.14.1/lib/core_kernel/iobuf/iobuf.cmxa /home/opam/.opam/4.14.1/lib/core/time_stamp_counter/time_stamp_counter.cmxa -I /home/opam/.opam/4.14.1/lib/core/time_stamp_counter src/core_profiler.cmxa /home/opam/.opam/4.14.1/lib/re2/c/re2_c.cmxa -I /home/opam/.opam/4.14.1/lib/re2/c /home/opam/.opam/4.14.1/lib/core_kernel/rope/rope.cmxa /home/opam/.opam/4.14.1/lib/re2/re2.cmxa -I /home/opam/.opam/4.14.1/lib/re2 offline_tool/lib/core_profiler_offline_tool.cmxa /home/opam/.opam/4.14.1/lib/shell/string_extended/string_extended.cmxa /home/opam/.opam/4.14.1/lib/textutils_kernel/text_graph/text_graph.cmxa offline_tool/bin/.dump_metrics.eobjs/native/profiler_tool.cmx)
- ld: error: undefined symbol: core_linux_timerfd_create
- >>> referenced by linux_ext.o:(.text+0x3AED) in archive /home/opam/.opam/4.14.1/lib/core/linux_ext/linux_ext.a
- >>> referenced by linux_ext.o:(.data+0x26D0) in archive /home/opam/.opam/4.14.1/lib/core/linux_ext/linux_ext.a
- 
- ld: error: undefined symbol: core_linux_timerfd_settime
- >>> referenced by linux_ext.o:(.text+0x3D51) in archive /home/opam/.opam/4.14.1/lib/core/linux_ext/linux_ext.a
- >>> referenced by linux_ext.o:(.text+0x3F91) in archive /home/opam/.opam/4.14.1/lib/core/linux_ext/linux_ext.a
- >>> referenced by linux_ext.o:(.data+0x26C8) in archive /home/opam/.opam/4.14.1/lib/core/linux_ext/linux_ext.a
- 
- ld: error: undefined symbol: core_linux_timerfd_gettime
- >>> referenced by linux_ext.o:(.text+0x3EEA) in archive /home/opam/.opam/4.14.1/lib/core/linux_ext/linux_ext.a
- >>> referenced by linux_ext.o:(.data+0x26C0) in archive /home/opam/.opam/4.14.1/lib/core/linux_ext/linux_ext.a
- 
- ld: error: undefined symbol: core_linux_timerfd_CLOCK_REALTIME
- >>> referenced by linux_ext.o:(.text+0x6D81) in archive /home/opam/.opam/4.14.1/lib/core/linux_ext/linux_ext.a
- >>> referenced by linux_ext.o:(.data+0x26F0) in archive /home/opam/.opam/4.14.1/lib/core/linux_ext/linux_ext.a
- 
- ld: error: undefined symbol: core_linux_timerfd_CLOCK_MONOTONIC
- >>> referenced by linux_ext.o:(.text+0x6D9B) in archive /home/opam/.opam/4.14.1/lib/core/linux_ext/linux_ext.a
- >>> referenced by linux_ext.o:(.data+0x26E8) in archive /home/opam/.opam/4.14.1/lib/core/linux_ext/linux_ext.a
- 
- ld: error: undefined symbol: core_linux_timerfd_TFD_NONBLOCK
- >>> referenced by linux_ext.o:(.text+0x6E4D) in archive /home/opam/.opam/4.14.1/lib/core/linux_ext/linux_ext.a
- >>> referenced by linux_ext.o:(.data+0x26E0) in archive /home/opam/.opam/4.14.1/lib/core/linux_ext/linux_ext.a
- 
- ld: error: undefined symbol: core_linux_timerfd_TFD_CLOEXEC
- >>> referenced by linux_ext.o:(.text+0x6E66) in archive /home/opam/.opam/4.14.1/lib/core/linux_ext/linux_ext.a
- >>> referenced by linux_ext.o:(.data+0x26D8) in archive /home/opam/.opam/4.14.1/lib/core/linux_ext/linux_ext.a
- cc: error: linker command failed with exit code 1 (use -v to see invocation)
- File "caml_startup", line 1:
- Error: Error during linking (exit code 1)
[ERROR] The compilation of core_profiler.v0.14.0 failed at "dune build -p core_profiler -j 7".

#=== ERROR while compiling core_profiler.v0.14.0 ==============================#
# context              2.2.0~rc1~dev | freebsd/x86_64 | ocaml-base-compiler.4.14.1 | file:///home/opam/opam-repository
# path                 ~/.opam/4.14.1/.opam-switch/build/core_profiler.v0.14.0
# command              ~/.opam/4.14.1/bin/dune build -p core_profiler -j 7
# exit-code            1
# env-file             ~/.opam/log/core_profiler-48732-d3b662.env
# output-file          ~/.opam/log/core_profiler-48732-d3b662.out
### output ###
# [...]
# >>> referenced by linux_ext.o:(.data+0x26E8) in archive /home/opam/.opam/4.14.1/lib/core/linux_ext/linux_ext.a
# 
# ld: error: undefined symbol: core_linux_timerfd_TFD_NONBLOCK
# >>> referenced by linux_ext.o:(.text+0x6E4D) in archive /home/opam/.opam/4.14.1/lib/core/linux_ext/linux_ext.a
# >>> referenced by linux_ext.o:(.data+0x26E0) in archive /home/opam/.opam/4.14.1/lib/core/linux_ext/linux_ext.a
# 
# ld: error: undefined symbol: core_linux_timerfd_TFD_CLOEXEC
# >>> referenced by linux_ext.o:(.text+0x6E66) in archive /home/opam/.opam/4.14.1/lib/core/linux_ext/linux_ext.a
# >>> referenced by linux_ext.o:(.data+0x26D8) in archive /home/opam/.opam/4.14.1/lib/core/linux_ext/linux_ext.a
# cc: error: linker command failed with exit code 1 (use -v to see invocation)
# File "caml_startup", line 1:
# Error: Error during linking (exit code 1)



<><> Error report <><><><><><><><><><><><><><><><><><><><><><><><><><><><><><><>
+- The following actions failed
| - build core_profiler v0.14.0
+- 
+- The following changes have been performed
| - install base                v0.14.3
| - install base_bigstring      v0.14.0
| - install base_quickcheck     v0.14.1
| - install bin_prot            v0.14.1
| - install conf-g++            1.0
| - install core                v0.14.1
| - install core_kernel         v0.14.2
| - install csexp               1.5.2
| - install dune                3.16.0
| - install dune-configurator   3.16.0
| - install fieldslib           v0.14.0
| - install jane-street-headers v0.14.0
| - install jst-config          v0.14.1
| - install num                 1.5
| - install ocaml-compiler-libs v0.12.4
| - install octavius            1.2.2
| - install parsexp             v0.14.2
| - install ppx_assert          v0.14.0
| - install ppx_base            v0.14.0
| - install ppx_bench           v0.14.1
| - install ppx_bin_prot        v0.14.0
| - install ppx_cold            v0.14.0
| - install ppx_compare         v0.14.0
| - install ppx_custom_printf   v0.14.1
| - install ppx_derivers        1.2.1
| - install ppx_enumerate       v0.14.0
| - install ppx_expect          v0.14.2
| - install ppx_fields_conv     v0.14.2
| - install ppx_fixed_literal   v0.14.0
| - install ppx_hash            v0.14.0
| - install ppx_here            v0.14.0
| - install ppx_inline_test     v0.14.1
| - install ppx_jane            v0.14.0
| - install ppx_js_style        v0.14.1
| - install ppx_let             v0.14.0
| - install ppx_module_timer    v0.14.0
| - install ppx_optcomp         v0.14.3
| - install ppx_optional        v0.14.0
| - install ppx_pipebang        v0.14.0
| - install ppx_sexp_conv       v0.14.3
| - install ppx_sexp_message    v0.14.1
| - install ppx_sexp_value      v0.14.0
| - install ppx_stable          v0.14.1
| - install ppx_string          v0.14.1
| - install ppx_typerep_conv    v0.14.2
| - install ppx_variants_conv   v0.14.2
| - install ppxlib              0.25.1
| - install re                  1.11.0
| - install re2                 v0.14.0
| - install seq                 base
| - install sexplib             v0.14.0
| - install sexplib0            v0.14.0
| - install shell               v0.14.0
| - install spawn               v0.15.1
| - install splittable_random   v0.14.0
| - install stdio               v0.14.0
| - install stdlib-shims        0.3.0
| - install textutils           v0.14.0
| - install textutils_kernel    v0.14.0
| - install time_now            v0.14.0
| - install timezone            v0.14.0
| - install typerep             v0.14.0
| - install variantslib         v0.14.0
+- 

The former state can be restored with:
    /usr/local/bin/opam switch import "/home/opam/.opam/4.14.1/.opam-switch/backup/state-20240702213916.export"
'opam install -vy core_profiler.v0.14.0' failed.
jail: /usr/bin/su -l opam -c cd '/' && env OPAMCRITERIA='+removed' OPAMEXTERNALSOLVER='builtin-0install' OPAMUTF8='never' OPAMPRECISETRACKING='1' '/usr/bin/env' 'bash' '-c' '
opam remove -y "core_profiler.v0.14.0"
opam install -vy "core_profiler.v0.14.0"
res=$?
if [ $res = 31 ]; then
    if opam show -f x-ci-accept-failures: "core_profiler.v0.14.0" | grep -q '\''"freebsd"'\''; then
        echo "This package failed and has been disabled for CI using the '\''x-ci-accept-failures'\'' field."
        exit 69
    fi
fi


exit $res
': failed
"jail" "-c" "name=obuilder_32381_15050" "mount.fstab=/tmp/obuilder-jail-5c7b3b/fstab" "mount.devfs" "path=/obuilder/result/8774d0da8f5700a1e6f73ee0d3dfef84e9224ef15949a81cb0f317261ebf4b19/rootfs" "host=inherit" "ip6=inherit" "ip4=inherit" "command=/usr/bin/su" "-l" "opam" "-c" "cd '/' && env OPAMCRITERIA='+removed' OPAMEXTERNALSOLVER='builtin-0install' OPAMUTF8='never' OPAMPRECISETRACKING='1' '/usr/bin/env' 'bash' '-c' '
opam remove -y "core_profiler.v0.14.0"
opam install -vy "core_profiler.v0.14.0"
res=$?
if [ $res = 31 ]; then
    if opam show -f x-ci-accept-failures: "core_profiler.v0.14.0" | grep -q '\''"freebsd"'\''; then
        echo "This package failed and has been disabled for CI using the '\''x-ci-accept-failures'\'' field."
        exit 69
    fi
fi


exit $res
'" failed with exit status 1
Failed: Build failed