OCamllabs icon Home|Differences with the last checks|Previous runs


Building on spring

(from freebsd)
2024-04-19 05:46.22 ---> using "77d5fe31836124b4684d554707425c4fde23f9ef3df0a804431a47419573778d" from cache

/: (user (uid 1000) (gid 1000))

/: (env OPAMPRECISETRACKING 1)

/: (env OPAMUTF8 never)

/: (env OPAMEXTERNALSOLVER builtin-0install)

/: (env OPAMCRITERIA +removed)

/: (run (shell "sudo ln -f /usr/local/bin/opam-dev /usr/local/bin/opam"))
2024-04-19 05:46.23 ---> using "a2b22593046b56fadc85e22b0da7b84e903c1f5aa4d42a7c481121ceec28b31f" from cache

/: (run (network host)
        (shell "rm -rf ~/opam-repository && git clone -q 'https://github.com/ocaml/opam-repository' ~/opam-repository && git -C ~/opam-repository checkout -q f089d8564db935c703bea70a4b3d8335ffa1bef3"))
2024-04-19 05:46.23 ---> using "83de7f37a3fdfdf2af7d52001c195007ba3d03fbf63bb1c5deeb0bd7199a7e68" from cache

/: (run (shell "rm -rf ~/.opam && opam init -ya --bare ~/opam-repository"))
No configuration file found, using built-in defaults.
Checking for available remotes: rsync and local, git.
  - you won't be able to use mercurial repositories unless you install the hg command on your system.
  - you won't be able to use darcs repositories unless you install the darcs command on your system.


<><> Fetching repository information ><><><><><><><><><><><><><><><><><><><><><>
[default] Initialised

User configuration:
  ~/.profile is already up-to-date.
[NOTE] Make sure that ~/.profile is well sourced in your ~/.bashrc.

2024-04-19 05:46.24 ---> using "ae05d419fac6605f1fa37d4b0e1385766018ebaa3233982c89fd3cd33bf5b52b" from cache

/: (run (cache (opam-archives (target /home/opam/.opam/download-cache)))
        (network host)
        (shell "opam switch create --repositories=default '5.1.0' 'ocaml-base-compiler.5.1.0'"))

<><> Installing new switch packages <><><><><><><><><><><><><><><><><><><><><><>
Switch invariant: ["ocaml-base-compiler" {= "5.1.0"}]

<><> Processing actions <><><><><><><><><><><><><><><><><><><><><><><><><><><><>
-> installed base-bigarray.base
-> installed base-threads.base
-> installed base-unix.base
-> installed ocaml-options-vanilla.1
-> retrieved ocaml-base-compiler.5.1.0  (https://github.com/ocaml/ocaml/archive/5.1.0.tar.gz)
-> installed ocaml-base-compiler.5.1.0
-> installed ocaml-config.3
-> installed ocaml.5.1.0
-> installed base-domains.base
-> installed base-nnp.base
Done.
# Run eval $(opam env --switch=5.1.0) to update the current shell environment
2024-04-19 05:46.24 ---> using "00812c0655a363608144a2fbfe7a937b2ae842276c4f9d1df0b02161f399b104" from cache

/: (run (network host)
        (shell "opam update --depexts"))
[WARNING] Unknown update command for bsd, skipping system update
2024-04-19 05:46.25 ---> using "ed99a2b1c5a9bc50869d66e6efea1b612aec0720983f79577579611105ba004c" from cache

/: (run (cache (opam-archives (target /home/opam/.opam/download-cache)))
        (network host)
        (shell  "\
               \nopam remove -y \"scrypt.0.2.1\"\
               \nopam install -vy \"scrypt.0.2.1\"\
               \nres=$?\
               \nif [ $res = 31 ]; then\
               \n    if opam show -f x-ci-accept-failures: \"scrypt.0.2.1\" | grep -q '\"freebsd\"'; then\
               \n        echo \"This package failed and has been disabled for CI using the 'x-ci-accept-failures' field.\"\
               \n        exit 69\
               \n    fi\
               \nfi\
               \n\
               \n\
               \nexit $res\
               \n"))
[NOTE] scrypt.0.2.1 is not installed.

Nothing to do.
The following actions will be performed:
=== install 4 packages
  - install conf-libssl     4     [required by scrypt]
  - install conf-pkg-config 3     [required by conf-libssl]
  - install ocamlfind       1.9.6 [required by scrypt]
  - install scrypt          0.2.1

<><> Processing actions <><><><><><><><><><><><><><><><><><><><><><><><><><><><>
Processing  3/12:
Processing  4/12: [scrypt.0.2.1: http]
Processing  5/12: [scrypt.0.2.1: http] [conf-pkg-config: pkg-config]
-> retrieved ocamlfind.1.9.6  (cached)
[ocamlfind: patch] applying 0001-Harden-test-for-OCaml-5.patch
Processing  6/12: [scrypt.0.2.1: http] [conf-pkg-config: pkg-config] [ocamlfind: patch]
+ /usr/local/bin/pkg-config "--help" (CWD=/home/opam/.opam/5.1.0/.opam-switch/build/conf-pkg-config.3)
- usage: pkgconf [OPTIONS] [LIBRARIES]
- 
- basic options:
- 
-   --help                            this message
-   --about                           print pkgconf version and license to stdout
-   --version                         print supported pkg-config version to stdout
-   --verbose                         print additional information
-   --atleast-pkgconfig-version       check whether or not pkgconf is compatible
-                                     with a specified pkg-config version
-   --errors-to-stdout                print all errors on stdout instead of stderr
-   --print-errors                    ensure all errors are printed
-   --short-errors                    be less verbose about some errors
-   --silence-errors                  explicitly be silent about errors
-   --list-all                        list all known packages
-   --list-package-names              list all known package names
-   --simulate                        simulate walking the calculated dependency graph
-   --no-cache                        do not cache already seen packages when
-                                     walking the dependency graph
-   --log-file=filename               write an audit log to a specified file
-   --with-path=path                  adds a directory to the search path
-   --define-prefix                   override the prefix variable with one that is guessed based on
-                                     the location of the .pc file
-   --dont-define-prefix              do not override the prefix variable under any circumstances
-   --prefix-variable=varname         sets the name of the variable that pkgconf considers
-                                     to be the package prefix
-   --relocate=path                   relocates a path and exits (mostly for testsuite)
-   --dont-relocate-paths             disables path relocation support
- 
- cross-compilation personality support:
- 
-   --personality=triplet|filename    sets the personality to 'triplet' or a file named 'filename'
-   --dump-personality                dumps details concerning selected personality
- 
- checking specific pkg-config database entries:
- 
-   --atleast-version                 require a specific version of a module
-   --exact-version                   require an exact version of a module
-   --max-version                     require a maximum version of a module
-   --exists                          check whether or not a module exists
-   --uninstalled                     check whether or not an uninstalled module will be used
-   --no-uninstalled                  never use uninstalled modules when satisfying dependencies
-   --no-provides                     do not use 'provides' rules to resolve dependencies
-   --maximum-traverse-depth          maximum allowed depth for dependency graph
-   --static                          be more aggressive when computing dependency graph
-                                     (for static linking)
-   --shared                          use a simplified dependency graph (usually default)
-   --pure                            optimize a static dependency graph as if it were a normal
-                                     dependency graph
-   --env-only                        look only for package entries in PKG_CONFIG_PATH
-   --ignore-conflicts                ignore 'conflicts' rules in modules
-   --validate                        validate specific .pc files for correctness
- 
- querying specific pkg-config database fields:
- 
-   --define-variable=varname=value   define variable 'varname' as 'value'
-   --variable=varname                print specified variable entry to stdout
-   --cflags                          print required CFLAGS to stdout
-   --cflags-only-I                   print required include-dir CFLAGS to stdout
-   --cflags-only-other               print required non-include-dir CFLAGS to stdout
-   --libs                            print required linker flags to stdout
-   --libs-only-L                     print required LDPATH linker flags to stdout
-   --libs-only-l                     print required LIBNAME linker flags to stdout
-   --libs-only-other                 print required other linker flags to stdout
-   --print-requires                  print required dependency frameworks to stdout
-   --print-requires-private          print required dependency frameworks for static
-                                     linking to stdout
-   --print-provides                  print provided dependencies to stdout
-   --print-variables                 print all known variables in module to stdout
-   --digraph                         print entire dependency graph in graphviz 'dot' format
-   --keep-system-cflags              keep -I/usr/include entries in cflags output
-   --keep-system-libs                keep -L/usr/lib entries in libs output
-   --path                            show the exact filenames for any matching .pc files
-   --modversion                      print the specified module's version to stdout
-   --internal-cflags                 do not filter 'internal' cflags from output
-   --license                         print the specified module's license to stdout if known
- 
- filtering output:
- 
-   --msvc-syntax                     print translatable fragments in MSVC syntax
-   --fragment-filter=types           filter output fragments to the specified types
- 
- report bugs to <https://github.com/pkgconf/pkgconf/issues/new>.
-> compiled  conf-pkg-config.3
Processing  6/12: [scrypt.0.2.1: http] [ocamlfind: patch]
-> installed conf-pkg-config.3
Processing  7/12: [scrypt.0.2.1: http] [ocamlfind: patch]
Processing  8/12: [scrypt.0.2.1: http] [ocamlfind: patch]
-> installed conf-libssl.4
Processing  9/12: [scrypt.0.2.1: http] [ocamlfind: patch]
Processing  9/12: [scrypt.0.2.1: http] [ocamlfind: ./configure]
Processing  9/12: [ocamlfind: ./configure]
-> retrieved scrypt.0.2.1  (https://github.com/constfun/ocaml-scrypt/archive/v0.2.1.tar.gz)
+ /home/opam/.opam/5.1.0/.opam-switch/build/ocamlfind.1.9.6/./configure "-bindir" "/home/opam/.opam/5.1.0/bin" "-sitelib" "/home/opam/.opam/5.1.0/lib" "-mandir" "/home/opam/.opam/5.1.0/man" "-config" "/home/opam/.opam/5.1.0/lib/findlib.conf" "-no-custom" "-no-camlp4" (CWD=/home/opam/.opam/5.1.0/.opam-switch/build/ocamlfind.1.9.6)
- Welcome to findlib version 1.9.6
- Configuring core...
- Checking for #remove_directory...
- Testing threading model...
- systhread_supported: true
- Testing DLLs...
- Testing whether ppxopt can be supported...
- Checking for ocamlc -opaque...
- Checking for ocamlopt -g...
- Configuring libraries...
- unix: found (in +unix)
- dynlink: found (in +dynlink)
- bigarray: not present (possible since 4.08)
- compiler-libs: found
- dbm: not present (normal since 4.00)
- graphics: not present (normal since 4.09)
- num: not present (normal since 4.06)
- ocamlbuild: not present (normal since 4.03)
- ocamldoc: found (in +ocamldoc)
- raw_spacetime: not present (normal since 4.12)
- threads: found (in +threads)
- str: found (in +str)
- labltk: not present (normal since 4.02)
- native dynlink: found
- camlp4: disabled
- bytes: found, installing fake library
- Configuration for bytes written to site-lib-src/bytes/META
- Detecting compiler arguments: (extractor built) ok
- 
- About the OCAML core installation:
-     Standard library:      /home/opam/.opam/5.1.0/lib/ocaml
-     Binaries:              /home/opam/.opam/5.1.0/bin
-     Manual pages:          /home/opam/.opam/5.1.0/man
-     Multi-threading type:  posix
- The directory of site-specific packages will be
-     site-lib:              /home/opam/.opam/5.1.0/lib
- The configuration file is written to:
-     findlib config file:   /home/opam/.opam/5.1.0/lib/findlib.conf
- Software will be installed:
-     Libraries:             in <site-lib>/findlib
-     Binaries:              /home/opam/.opam/5.1.0/bin
-     Manual pages:          /home/opam/.opam/5.1.0/man
-     topfind script:        /home/opam/.opam/5.1.0/lib/ocaml
- Topfind ppxopt support:    yes
- Toolbox:                   no
- Link custom runtime:       no
- Need bytes compatibility:  no
- 
- Configuration has been written to Makefile.config
- 
- You can now do 'make all', and optionally 'make opt', to build ocamlfind.
Processing  9/12: [ocamlfind: gmake all]
+ /usr/local/bin/gmake "all" (CWD=/home/opam/.opam/5.1.0/.opam-switch/build/ocamlfind.1.9.6)
- for p in findlib; do ( cd src/$p; /usr/local/bin/gmake all ) || exit; done
- gmake[1]: Entering directory '/home/opam/.opam/5.1.0/.opam-switch/build/ocamlfind.1.9.6/src/findlib'
- ocamllex fl_meta.mll
- 22 states, 392 transitions, table size 1700 bytes
- USE_CYGPATH="0"; \
- export USE_CYGPATH; \
- cat findlib_config.mlp | \
-          ../../tools/patch '@CONFIGFILE@' '/home/opam/.opam/5.1.0/lib/findlib.conf' | \
-          ../../tools/patch '@STDLIB@' '/home/opam/.opam/5.1.0/lib/ocaml' | \
- 	sed -e 's;@AUTOLINK@;true;g' \
- 	    -e 's;@SYSTEM@;freebsd;g' \
- 	     >findlib_config.ml
- if [ "true" = "true" ]; then                 \
- 	cp topfind.ml.in topfind.ml;                             \
- else                                                             \
- 	sed -e '/PPXOPT_BEGIN/,/PPXOPT_END/ d' topfind.ml.in     \
- 		> topfind.ml ;                                   \
- fi
- ocamldep *.ml *.mli >depend
- ocamlc -I +compiler-libs -opaque   -I +unix -I +dynlink -g -c findlib_config.ml
- ocamlc -I +compiler-libs -opaque   -I +unix -I +dynlink -g -c fl_split.ml
- ocamlc -I +compiler-libs -opaque   -I +unix -I +dynlink -g -c fl_metatoken.ml
- ocamlc -I +compiler-libs -opaque   -I +unix -I +dynlink -g -c fl_meta.ml
- ocamlc -I +compiler-libs -opaque   -I +unix -I +dynlink -c fl_metascanner.mli
- ocamlc -I +compiler-libs -opaque   -I +unix -I +dynlink -g -c fl_metascanner.ml
- ocamlc -I +compiler-libs -opaque   -I +unix -I +dynlink -c fl_topo.mli
- ocamlc -I +compiler-libs -opaque   -I +unix -I +dynlink -g -c fl_topo.ml
- ocamlc -I +compiler-libs -opaque   -I +unix -I +dynlink -c fl_package_base.mli
- ocamlc -I +compiler-libs -opaque   -I +unix -I +dynlink -g -c fl_package_base.ml
- File "fl_package_base.ml", line 304, characters 22-40:
- 304 | 	 let pkg_ancestors = query_requirements predlist pkg in
-       	                     ^^^^^^^^^^^^^^^^^^
- Warning 6 [labels-omitted]: label preds was omitted in the application of this function.
- 
- File "fl_package_base.ml", line 350, characters 18-36:
- 350 |   let ancestors = query_requirements predlist package_name in
-                         ^^^^^^^^^^^^^^^^^^
- Warning 6 [labels-omitted]: label preds was omitted in the application of this function.
- 
- File "fl_package_base.ml", line 375, characters 23-41:
- 375 | 	  let pkg_ancestors = query_requirements predlist pkg in
-       	                      ^^^^^^^^^^^^^^^^^^
- Warning 6 [labels-omitted]: label preds was omitted in the application of this function.
- 
- File "fl_package_base.ml", line 510, characters 16-35:
- 510 | 	     ( let c = package_definitions search_path pkg.package_name in
-       	               ^^^^^^^^^^^^^^^^^^^
- Warning 6 [labels-omitted]: label search_path was omitted in the application of this function.
- ocamlc -I +compiler-libs -opaque   -I +unix -I +dynlink -c findlib.mli
- ocamlc -I +compiler-libs -opaque   -I +unix -I +dynlink -g -c findlib.ml
- File "findlib.ml", line 390, characters 2-26:
- 390 |   Fl_package_base.requires predlist pkg
-         ^^^^^^^^^^^^^^^^^^^^^^^^
- Warning 6 [labels-omitted]: label preds was omitted in the application of this function.
- 
- File "findlib.ml", line 396, characters 2-33:
- 396 |   Fl_package_base.requires_deeply predlist pkglist
-         ^^^^^^^^^^^^^^^^^^^^^^^^^^^^^^^
- Warning 6 [labels-omitted]: label preds was omitted in the application of this function.
- ocamlc -I +compiler-libs -opaque   -I +unix -I +dynlink -g -c fl_args.ml
- ocamlc -I +compiler-libs -opaque   -I +unix -I +dynlink -g -c fl_lint.ml
- ocamlc -I +compiler-libs -a -o findlib.cma findlib_config.cmo fl_split.cmo fl_metatoken.cmo fl_meta.cmo fl_metascanner.cmo fl_topo.cmo fl_package_base.cmo findlib.cmo fl_args.cmo fl_lint.cmo
- ocamlc -I +compiler-libs -opaque   -I +unix -I +dynlink -g -c ocaml_args.ml
- ocamlc -I +compiler-libs -opaque   -I +unix -I +dynlink -g -c frontend.ml
- File "frontend.ml", line 859, characters 10-39:
- 859 |           Fl_package_base.package_users predicates1 packages1
-                 ^^^^^^^^^^^^^^^^^^^^^^^^^^^^^
- Warning 6 [labels-omitted]: label preds was omitted in the application of this function.
- ocamlc -I +compiler-libs  -o ocamlfind -g findlib.cma unix.cma \
-            -I +unix -I +dynlink ocaml_args.cmo frontend.cmo
- ocamlc -I +compiler-libs -opaque   -I +unix -I +dynlink -c topfind.mli
- ocamlc -I +compiler-libs -opaque   -I +unix -I +dynlink -g -c topfind.ml
- File "topfind.ml", line 128, characters 40-63:
- 128 |                      match Hashtbl.find Toploop.directive_table "ppx" with
-                                               ^^^^^^^^^^^^^^^^^^^^^^^
- Alert deprecated: Toploop.directive_table
- 
- File "topfind.ml", line 258, characters 4-27:
- 258 |     Toploop.directive_table
-           ^^^^^^^^^^^^^^^^^^^^^^^
- Alert deprecated: Toploop.directive_table
- 
- File "topfind.ml", line 268, characters 4-27:
- 268 |     Toploop.directive_table
-           ^^^^^^^^^^^^^^^^^^^^^^^
- Alert deprecated: Toploop.directive_table
- 
- File "topfind.ml", line 280, characters 4-27:
- 280 |     Toploop.directive_table
-           ^^^^^^^^^^^^^^^^^^^^^^^
- Alert deprecated: Toploop.directive_table
- 
- File "topfind.ml", line 293, characters 4-27:
- 293 |     Toploop.directive_table
-           ^^^^^^^^^^^^^^^^^^^^^^^
- Alert deprecated: Toploop.directive_table
- 
- File "topfind.ml", line 307, characters 4-27:
- 307 |     Toploop.directive_table
-           ^^^^^^^^^^^^^^^^^^^^^^^
- Alert deprecated: Toploop.directive_table
- 
- File "topfind.ml", line 319, characters 4-27:
- 319 |     Toploop.directive_table
-           ^^^^^^^^^^^^^^^^^^^^^^^
- Alert deprecated: Toploop.directive_table
- ocamlc -I +compiler-libs -a -o findlib_top.cma topfind.cmo
- USE_CYGPATH="0"; \
- export USE_CYGPATH; \
- cat topfind_rd1.p | \
-          ../../tools/patch '@SITELIB@' '/home/opam/.opam/5.1.0/lib' \
-     	    >topfind
- ocamlc -I +compiler-libs -opaque   -I +unix -I +dynlink -c fl_dynload.mli
- ocamlc -I +compiler-libs -opaque   -I +unix -I +dynlink -g -c fl_dynload.ml
- ocamlc -I +compiler-libs -a -o findlib_dynload.cma fl_dynload.cmo
- gmake[1]: Leaving directory '/home/opam/.opam/5.1.0/.opam-switch/build/ocamlfind.1.9.6/src/findlib'
- /usr/local/bin/gmake all-config
- gmake[1]: Entering directory '/home/opam/.opam/5.1.0/.opam-switch/build/ocamlfind.1.9.6'
- USE_CYGPATH="0"; \
- export USE_CYGPATH; \
- cat findlib.conf.in | \
-      tools/patch '@SITELIB@' '/home/opam/.opam/5.1.0/lib' | \
- 		 tools/patch '@FINDLIB_PATH@' '/home/opam/.opam/5.1.0/lib/ocaml:/home/opam/.opam/5.1.0/lib' -p >findlib.conf
- if ./tools/cmd_from_same_dir ocamlc; then \
- 	echo 'ocamlc="ocamlc.opt"' >>findlib.conf; \
- fi
- if ./tools/cmd_from_same_dir ocamlopt; then \
- 	echo 'ocamlopt="ocamlopt.opt"' >>findlib.conf; \
- fi
- if ./tools/cmd_from_same_dir ocamldep; then \
- 	echo 'ocamldep="ocamldep.opt"' >>findlib.conf; \
- fi
- if ./tools/cmd_from_same_dir ocamldoc; then \
- 	echo 'ocamldoc="ocamldoc.opt"' >>findlib.conf; \
- fi
- gmake[1]: Leaving directory '/home/opam/.opam/5.1.0/.opam-switch/build/ocamlfind.1.9.6'
Processing  9/12: [ocamlfind: gmake opt]
+ /usr/local/bin/gmake "opt" (CWD=/home/opam/.opam/5.1.0/.opam-switch/build/ocamlfind.1.9.6)
- for p in findlib; do ( cd src/$p; /usr/local/bin/gmake opt ) || exit; done
- gmake[1]: Entering directory '/home/opam/.opam/5.1.0/.opam-switch/build/ocamlfind.1.9.6/src/findlib'
- ocamlopt -I +compiler-libs -g -opaque  -I +unix -I +dynlink -c findlib_config.ml
- ocamlopt -I +compiler-libs -g -opaque  -I +unix -I +dynlink -c fl_split.ml
- ocamlopt -I +compiler-libs -g -opaque  -I +unix -I +dynlink -c fl_metatoken.ml
- ocamlopt -I +compiler-libs -g -opaque  -I +unix -I +dynlink -c fl_meta.ml
- ocamlopt -I +compiler-libs -g -opaque  -I +unix -I +dynlink -c fl_metascanner.ml
- ocamlopt -I +compiler-libs -g -opaque  -I +unix -I +dynlink -c fl_topo.ml
- ocamlopt -I +compiler-libs -g -opaque  -I +unix -I +dynlink -c fl_package_base.ml
- File "fl_package_base.ml", line 304, characters 22-40:
- 304 | 	 let pkg_ancestors = query_requirements predlist pkg in
-       	                     ^^^^^^^^^^^^^^^^^^
- Warning 6 [labels-omitted]: label preds was omitted in the application of this function.
- 
- File "fl_package_base.ml", line 350, characters 18-36:
- 350 |   let ancestors = query_requirements predlist package_name in
-                         ^^^^^^^^^^^^^^^^^^
- Warning 6 [labels-omitted]: label preds was omitted in the application of this function.
- 
- File "fl_package_base.ml", line 375, characters 23-41:
- 375 | 	  let pkg_ancestors = query_requirements predlist pkg in
-       	                      ^^^^^^^^^^^^^^^^^^
- Warning 6 [labels-omitted]: label preds was omitted in the application of this function.
- 
- File "fl_package_base.ml", line 510, characters 16-35:
- 510 | 	     ( let c = package_definitions search_path pkg.package_name in
-       	               ^^^^^^^^^^^^^^^^^^^
- Warning 6 [labels-omitted]: label search_path was omitted in the application of this function.
- ocamlopt -I +compiler-libs -g -opaque  -I +unix -I +dynlink -c findlib.ml
- File "findlib.ml", line 390, characters 2-26:
- 390 |   Fl_package_base.requires predlist pkg
-         ^^^^^^^^^^^^^^^^^^^^^^^^
- Warning 6 [labels-omitted]: label preds was omitted in the application of this function.
- 
- File "findlib.ml", line 396, characters 2-33:
- 396 |   Fl_package_base.requires_deeply predlist pkglist
-         ^^^^^^^^^^^^^^^^^^^^^^^^^^^^^^^
- Warning 6 [labels-omitted]: label preds was omitted in the application of this function.
- ocamlopt -I +compiler-libs -g -opaque  -I +unix -I +dynlink -c fl_args.ml
- ocamlopt -I +compiler-libs -g -opaque  -I +unix -I +dynlink -c fl_lint.ml
- ocamlopt -I +compiler-libs -g -a -o findlib.cmxa findlib_config.cmx fl_split.cmx fl_metatoken.cmx fl_meta.cmx fl_metascanner.cmx fl_topo.cmx fl_package_base.cmx findlib.cmx fl_args.cmx fl_lint.cmx
- if [ 1 -gt 0 ]; then \
-     ocamlopt -I +compiler-libs -g -shared -o findlib.cmxs findlib_config.cmx fl_split.cmx fl_metatoken.cmx fl_meta.cmx fl_metascanner.cmx fl_topo.cmx fl_package_base.cmx findlib.cmx fl_args.cmx fl_lint.cmx; \
- fi
- ocamlopt -I +compiler-libs -g -opaque  -I +unix -I +dynlink -c ocaml_args.ml
- ocamlopt -I +compiler-libs -g -opaque  -I +unix -I +dynlink -c frontend.ml
- File "frontend.ml", line 859, characters 10-39:
- 859 |           Fl_package_base.package_users predicates1 packages1
-                 ^^^^^^^^^^^^^^^^^^^^^^^^^^^^^
- Warning 6 [labels-omitted]: label preds was omitted in the application of this function.
- ocamlopt -I +compiler-libs -g -o ocamlfind_opt findlib.cmxa unix.cmxa \
- 	   -I +unix -I +dynlink ocaml_args.cmx frontend.cmx
- ocamlopt -I +compiler-libs -g -opaque  -I +unix -I +dynlink -c topfind.ml
- File "topfind.ml", line 128, characters 40-63:
- 128 |                      match Hashtbl.find Toploop.directive_table "ppx" with
-                                               ^^^^^^^^^^^^^^^^^^^^^^^
- Alert deprecated: Toploop.directive_table
- 
- File "topfind.ml", line 258, characters 4-27:
- 258 |     Toploop.directive_table
-           ^^^^^^^^^^^^^^^^^^^^^^^
- Alert deprecated: Toploop.directive_table
- 
- File "topfind.ml", line 268, characters 4-27:
- 268 |     Toploop.directive_table
-           ^^^^^^^^^^^^^^^^^^^^^^^
- Alert deprecated: Toploop.directive_table
- 
- File "topfind.ml", line 280, characters 4-27:
- 280 |     Toploop.directive_table
-           ^^^^^^^^^^^^^^^^^^^^^^^
- Alert deprecated: Toploop.directive_table
- 
- File "topfind.ml", line 293, characters 4-27:
- 293 |     Toploop.directive_table
-           ^^^^^^^^^^^^^^^^^^^^^^^
- Alert deprecated: Toploop.directive_table
- 
- File "topfind.ml", line 307, characters 4-27:
- 307 |     Toploop.directive_table
-           ^^^^^^^^^^^^^^^^^^^^^^^
- Alert deprecated: Toploop.directive_table
- 
- File "topfind.ml", line 319, characters 4-27:
- 319 |     Toploop.directive_table
-           ^^^^^^^^^^^^^^^^^^^^^^^
- Alert deprecated: Toploop.directive_table
- ocamlopt -I +compiler-libs -g -a -o findlib_top.cmxa topfind.cmx
- if [ 1 -gt 0 ]; then \
-     ocamlopt -I +compiler-libs -g -shared -o findlib_top.cmxs topfind.cmx; \
- fi
- ocamlopt -I +compiler-libs -g -opaque  -I +unix -I +dynlink -c fl_dynload.ml
- ocamlopt -I +compiler-libs -g -a -o findlib_dynload.cmxa fl_dynload.cmx
- if [ 1 -gt 0 ]; then \
-     ocamlopt -I +compiler-libs -g -shared -o findlib_dynload.cmxs fl_dynload.cmx; \
- fi
- gmake[1]: Leaving directory '/home/opam/.opam/5.1.0/.opam-switch/build/ocamlfind.1.9.6/src/findlib'
-> compiled  ocamlfind.1.9.6
Processing 10/12: [ocamlfind: gmake install]
+ /usr/local/bin/gmake "install" (CWD=/home/opam/.opam/5.1.0/.opam-switch/build/ocamlfind.1.9.6)
- if [ "0" -eq 1 ]; then \
-     for x in camlp4 dbm graphics labltk num ocamlbuild; do \
-       if [ -f "/home/opam/.opam/5.1.0/lib/$x/META" ]; then \
-         if ! grep -Fq '[distributed with Ocaml]' "//home/opam/.opam/5.1.0/lib/$x/META"; then \
-           rm -f site-lib-src/$x/META; \
-         fi; \
-       fi; \
-     done; \
-     test -f "site-lib-src/num/META" || rm -f "site-lib-src/num-top/META"; \
-   fi
- echo 'SITELIB_META =' > Makefile.packages.in
- for x in `ls site-lib-src`; do test ! -f "site-lib-src/$x/META" || echo $x >> Makefile.packages.in; done
- tr '\n' ' ' < Makefile.packages.in > Makefile.packages
- rm Makefile.packages.in
- install -d "/home/opam/.opam/5.1.0/bin"
- install -d "/home/opam/.opam/5.1.0/man"
- /usr/local/bin/gmake install-config
- gmake[1]: Entering directory '/home/opam/.opam/5.1.0/.opam-switch/build/ocamlfind.1.9.6'
- install -d "`dirname \"/home/opam/.opam/5.1.0/lib/findlib.conf\"`"
- test -f "/home/opam/.opam/5.1.0/lib/findlib.conf" || install -c findlib.conf "/home/opam/.opam/5.1.0/lib/findlib.conf"
- gmake[1]: Leaving directory '/home/opam/.opam/5.1.0/.opam-switch/build/ocamlfind.1.9.6'
- for p in findlib; do ( cd src/$p; /usr/local/bin/gmake install ); done
- gmake[1]: Entering directory '/home/opam/.opam/5.1.0/.opam-switch/build/ocamlfind.1.9.6/src/findlib'
- install -d "/home/opam/.opam/5.1.0/lib/findlib"
- install -d "/home/opam/.opam/5.1.0/bin"
- test 1 -eq 0 || install -d "/home/opam/.opam/5.1.0/lib/ocaml"
- test 1 -eq 0 || install -c topfind "/home/opam/.opam/5.1.0/lib/ocaml/"
- files=` ../../tools/collect_files ../../Makefile.config \
- findlib.cmi findlib.mli findlib.cma findlib.cmxa findlib.a findlib.cmxs \
- findlib_config.cmi findlib_config.ml topfind.cmi topfind.mli \
- fl_args.cmi fl_lint.cmi fl_meta.cmi fl_split.cmi fl_topo.cmi ocaml_args.cmi \
- fl_package_base.mli fl_package_base.cmi fl_metascanner.mli fl_metascanner.cmi \
- fl_metatoken.cmi findlib_top.cma findlib_top.cmxa findlib_top.a findlib_top.cmxs \
- findlib_dynload.cma findlib_dynload.cmxa findlib_dynload.a findlib_dynload.cmxs fl_dynload.mli fl_dynload.cmi \
- META` && \
- install -c $files "/home/opam/.opam/5.1.0/lib/findlib/"
- f="ocamlfind"; { test -f ocamlfind_opt && f="ocamlfind_opt"; }; \
- install -c $f "/home/opam/.opam/5.1.0/bin/ocamlfind"
- # the following "if" block is only needed for 4.00beta2
- if [ 1 -eq 0 -a -f "/home/opam/.opam/5.1.0/lib/ocaml/compiler-libs/topdirs.cmi" ]; then \
-     cd "/home/opam/.opam/5.1.0/lib/ocaml/compiler-libs/"; \
-     install -c topdirs.cmi toploop.cmi "/home/opam/.opam/5.1.0/lib/findlib/"; \
- fi
- gmake[1]: Leaving directory '/home/opam/.opam/5.1.0/.opam-switch/build/ocamlfind.1.9.6/src/findlib'
- /usr/local/bin/gmake install-meta
- gmake[1]: Entering directory '/home/opam/.opam/5.1.0/.opam-switch/build/ocamlfind.1.9.6'
- for x in bytes ; do install -d "/home/opam/.opam/5.1.0/lib/$x"; install -c site-lib-src/$x/META "/home/opam/.opam/5.1.0/lib/$x/META.tmp" && mv "/home/opam/.opam/5.1.0/lib/$x/META.tmp" "/home/opam/.opam/5.1.0/lib/$x/META"; done
- install -d "/home/opam/.opam/5.1.0/lib/findlib"; install -c Makefile.packages "/home/opam/.opam/5.1.0/lib/findlib/Makefile.packages"
- gmake[1]: Leaving directory '/home/opam/.opam/5.1.0/.opam-switch/build/ocamlfind.1.9.6'
- test ! -f 'site-lib-src/num-top/META' || { cd src/findlib; /usr/local/bin/gmake install-num-top; }
- test ! -f 'site-lib-src/camlp4/META' ||	install -c tools/safe_camlp4 "/home/opam/.opam/5.1.0/bin"
- /usr/local/bin/gmake install-doc
- gmake[1]: Entering directory '/home/opam/.opam/5.1.0/.opam-switch/build/ocamlfind.1.9.6'
- install -d "/home/opam/.opam/5.1.0/man/man1" "/home/opam/.opam/5.1.0/man/man3" "/home/opam/.opam/5.1.0/man/man5"
- install -c doc/ref-man/ocamlfind.1 "/home/opam/.opam/5.1.0/man/man1"
- install -c doc/ref-man/META.5 doc/ref-man/site-lib.5 doc/ref-man/findlib.conf.5 "/home/opam/.opam/5.1.0/man/man5"
- gmake[1]: Leaving directory '/home/opam/.opam/5.1.0/.opam-switch/build/ocamlfind.1.9.6'
-> installed ocamlfind.1.9.6
[scrypt: patch] applying no-ctypes-dependency.patch
Processing 11/12: [scrypt: patch]
Processing 11/12: [scrypt: gmake]
+ /usr/local/bin/gmake  (CWD=/home/opam/.opam/5.1.0/.opam-switch/build/scrypt.0.2.1)
- # Compile scrypt, but immediately explode the library into it's object files.
- # We do this to merge the objects with scrypt_stubs.o into a new, unified, library under the name libscrypt.a
- # The merging step happens during ocamlmklib linking.
- cd libscrypt && make && ar x libscrypt.a
- cd scrypt-1.1.6 && ./configure
- checking for a BSD-compatible install... /usr/bin/install -c
- checking whether build environment is sane... 
- yes
- checking for a thread-safe mkdir -p... config.aux/install-sh -c -d
- checking for gawk... no
- checking for mawk... no
- checking for nawk... nawk
- checking whether make sets $(MAKE)... 
- yes
- checking whether to enable maintainer-specific portions of Makefiles... no
- checking for gcc... no
- checking for cc... cc
- checking for C compiler default output file name... a.out
- checking whether the C compiler works... yes
- checking whether we are cross compiling... no
- checking for suffix of executables... 
- checking for suffix of object files... 
- o
- checking whether we are using the GNU C compiler... yes
- checking whether cc accepts -g... yes
- checking for cc option to accept ISO C89... none needed
- checking for style of include used by make... GNU
- checking dependency style of cc... 
- gcc3
- checking how to run the C preprocessor... cc -E
- checking for grep that handles long lines and -e... /usr/bin/grep
- checking for egrep... /usr/bin/grep -E
- checking for ANSI C header files... yes
- checking for sys/types.h... yes
- checking for sys/stat.h... yes
- checking for stdlib.h... yes
- checking for string.h... yes
- checking for memory.h... yes
- checking for strings.h... yes
- checking for inttypes.h... yes
- checking for stdint.h... yes
- checking for unistd.h... yes
- checking sys/endian.h usability... yes
- checking sys/endian.h presence... 
- yes
- checking for sys/endian.h... yes
- checking whether be64enc is declared... yes
- checking err.h usability... yes
- checking err.h presence... yes
- checking for err.h... yes
- checking for clock_gettime in -lrt... 
- yes
- checking for clock_gettime... yes
- checking sys/sysinfo.h usability... 
- no
- checking sys/sysinfo.h presence... no
- checking for sys/sysinfo.h... no
- checking for sysinfo... no
- checking for struct sysinfo... 
- no
- checking for struct sysinfo.totalram... no
- checking for struct sysinfo.mem_unit... no
- checking sys/param.h usability... 
- yes
- checking sys/param.h presence... yes
- checking for sys/param.h... yes
- checking for posix_memalign... 
- yes
- checking for special C compiler options needed for large files... no
- checking for _FILE_OFFSET_BITS value needed for large files... no
- configure: creating ./config.status
- config.status: creating Makefile
- config.status: creating config.h
- config.status: executing depfiles commands
- ar rcs libscrypt.a 
- ranlib libscrypt.a
- cc -g -O2 -fPIC -lcrypto -DHAVE_CONFIG_H  -Iscrypt-1.1.6  -Iscrypt-1.1.6/lib/crypto  -Iscrypt-1.1.6/lib/scryptenc  -Iscrypt-1.1.6/lib/util -shared -o libscrypt.so 
- cp scrypt-1.1.6/lib/scryptenc/scryptenc.h scrypt.h
- # Comple just the stubs into an object file.
- #
- # The stubs expect to find "scrypt.h" on include path.
- ocamlfind ocamlopt -o scrypt_stubs scrypt_stubs.c -ccopt -fPIC -ccopt -Ilibscrypt
- scrypt_stubs.c:49:7: warning: assigning to 'value *' (aka 'long *') from 'const value *' (aka 'const long *') discards qualifiers [-Wincompatible-pointer-types-discards-qualifiers]
-                 exn = caml_named_value("Scrypt_error");
-                     ^ ~~~~~~~~~~~~~~~~~~~~~~~~~~~~~~~~
- 1 warning generated.
- # Compile scrypt.mli (the interface) to a cmi (compiled module interface).
- # Compile scrypt.ml to bytecode (cmo).
- #
- # The order of files matters here.
- # Since there is a module interface defined (mli), the compiler expects to find a compiled version of it (cmi) before compiling the ml file.
- ocamlfind ocamlc -c scrypt.mli scrypt.ml
- # Compile scrypt.ml to scrypt.o (native code) and scrypt.cmx (extra information for optimizing and linking the native code.)
- ocamlfind ocamlopt -c scrypt.ml
- # Take:
- #	* C object files, scrypt_stubs.o and all object files extracted from libscrypt/libscrypt.a.
- #	* Bytecode object file scrypt.cmo
- #	* Native object file scrypt.cmx + scrypt.o, we supply just the .cmx, but it points to the .o, and it is included in resulting scrypt.a.
- #
- # Link it all to produce the following files:
- #       libscrypt.a, contains scrypt_stubs.o and libscrypt/*.o:
- #		Most of the C portion of our library.
- #		libscrypt.a MUST be installed, see cmxa.
- #
- #	scrypt.a, contains scrypt.o:
- #		Native version of scrypt.ml, does NOT include the stubs.
- #		XXX: I'm not sure why this has to be a separate archive and isn't combined with libscrypt.a.
- #		     What happens when you have more files? Do you then have to install a bunch of .a files with your library?
- #		scrypt.a MUST be installed, see cmxa.
- #
- #	scrypt.cma, contains scrypt.cmo:
- #		Bytecode version of library.
- #		scrypt.cma MUST be installed.
- #		scrypt.cmo is NOT installed since it is fully comtained in scrypt.cma.
- #
- #	scrypt.cmxa, contains scrypt.cmx and combines it (without containing) with  scrypt.a, and libscrypt.a:
- #		These files comprise the native version of the library.
- #		scrypt.cmxa, scrypt.a, and libscrypt.a MUST be installed and linked together.
- #			The -cclib options accomplish this task transparently, since they
- #			are memoized in scrypt.cmxa and are automatically applied whenever a client links to the library.
- #		scrypt.cmx is NOT installed since it is fully contained in scrypt.cmxa.
- #
- #	-lcrypto is OpenSSL (scrypt dependency) and must be present on on the system, it will also link the resulting dllscrypt.so with libcrypto.so.
- ocamlfind ocamlmklib -v -o scrypt scrypt.cmo scrypt.cmx scrypt_stubs.o libscrypt/*.o -lcrypto -cclib -lscrypt -cclib -lcrypto
- + cc -shared    -o ./dllscrypt.so scrypt_stubs.o libscrypt/*.o    -lcrypto 
- cc: error: no such file or directory: 'libscrypt/*.o'
- gmake: *** [Makefile:46: all] Error 2
[ERROR] The compilation of scrypt.0.2.1 failed at "gmake".

#=== ERROR while compiling scrypt.0.2.1 =======================================#
# context              2.2.0~beta2~dev | freebsd/x86_64 | ocaml-base-compiler.5.1.0 | file:///home/opam/opam-repository
# path                 ~/.opam/5.1.0/.opam-switch/build/scrypt.0.2.1
# command              /usr/local/bin/gmake
# exit-code            2
# env-file             ~/.opam/log/scrypt-50137-1c4ee7.env
# output-file          ~/.opam/log/scrypt-50137-1c4ee7.out
### output ###
# [...]
# #	scrypt.cmxa, contains scrypt.cmx and combines it (without containing) with  scrypt.a, and libscrypt.a:
# #		These files comprise the native version of the library.
# #		scrypt.cmxa, scrypt.a, and libscrypt.a MUST be installed and linked together.
# #			The -cclib options accomplish this task transparently, since they
# #			are memoized in scrypt.cmxa and are automatically applied whenever a client links to the library.
# #		scrypt.cmx is NOT installed since it is fully contained in scrypt.cmxa.
# #
# #	-lcrypto is OpenSSL (scrypt dependency) and must be present on on the system, it will also link the resulting dllscrypt.so with libcrypto.so.
# ocamlfind ocamlmklib -v -o scrypt scrypt.cmo scrypt.cmx scrypt_stubs.o libscrypt/*.o -lcrypto -cclib -lscrypt -cclib -lcrypto
# + cc -shared    -o ./dllscrypt.so scrypt_stubs.o libscrypt/*.o    -lcrypto 
# cc: error: no such file or directory: 'libscrypt/*.o'
# gmake: *** [Makefile:46: all] Error 2



<><> Error report <><><><><><><><><><><><><><><><><><><><><><><><><><><><><><><>
+- The following actions failed
| - build scrypt 0.2.1
+- 
+- The following changes have been performed
| - install conf-libssl     4
| - install conf-pkg-config 3
| - install ocamlfind       1.9.6
+- 

The former state can be restored with:
    /usr/local/bin/opam switch import "/home/opam/.opam/5.1.0/.opam-switch/backup/state-20240419054630.export"
'opam install -vy scrypt.0.2.1' failed.
jail: /usr/bin/su -l opam -c cd '/' && env OPAMCRITERIA='+removed' OPAMEXTERNALSOLVER='builtin-0install' OPAMUTF8='never' OPAMPRECISETRACKING='1' '/usr/bin/env' 'bash' '-c' '
opam remove -y "scrypt.0.2.1"
opam install -vy "scrypt.0.2.1"
res=$?
if [ $res = 31 ]; then
    if opam show -f x-ci-accept-failures: "scrypt.0.2.1" | grep -q '\''"freebsd"'\''; then
        echo "This package failed and has been disabled for CI using the '\''x-ci-accept-failures'\'' field."
        exit 69
    fi
fi


exit $res
': failed
"jail" "-c" "name=obuilder_34190_57451" "mount.fstab=/tmp/obuilder-jail-d02383/fstab" "mount.devfs" "path=/obuilder/result/53310f14076c64bee63f52bb208b1e3e65af5d86ec66a98b3189223934d4f51e/rootfs" "host=inherit" "ip6=inherit" "ip4=inherit" "command=/usr/bin/su" "-l" "opam" "-c" "cd '/' && env OPAMCRITERIA='+removed' OPAMEXTERNALSOLVER='builtin-0install' OPAMUTF8='never' OPAMPRECISETRACKING='1' '/usr/bin/env' 'bash' '-c' '
opam remove -y "scrypt.0.2.1"
opam install -vy "scrypt.0.2.1"
res=$?
if [ $res = 31 ]; then
    if opam show -f x-ci-accept-failures: "scrypt.0.2.1" | grep -q '\''"freebsd"'\''; then
        echo "This package failed and has been disabled for CI using the '\''x-ci-accept-failures'\'' field."
        exit 69
    fi
fi


exit $res
'" failed with exit status 1
Failed: Build failed