Building on summer
(from freebsd-ocaml-5.0)
2023-11-01 16:31.30 ---> using "b0ee167c73857b60ecf6c06eff6bbe96857a02ac84fefd2b9807cb2eea16bf97" from cache
/: (user (uid 1000) (gid 1000))
/: (env OPAMPRECISETRACKING 1)
/: (env OPAMUTF8 never)
/: (env OPAMEXTERNALSOLVER builtin-0install)
/: (env OPAMCRITERIA +removed)
/: (run (shell "sudo ln -f /usr/local/bin/opam-2.1 /usr/local/bin/opam"))
2023-11-01 16:31.31 ---> using "58da31f76f3dd28576bb2b11a05c1473a2cbc0bc8e959f83414ab7001888e94f" from cache
/: (run (network host)
(shell "rm -rf ~/opam-repository && git clone -q 'https://github.com/ocaml/opam-repository' ~/opam-repository && git -C ~/opam-repository checkout -q 7b4cedddee88c79d6bdb00eccf7b36a7b617b211"))
2023-11-01 16:31.31 ---> using "ceda9c602c42ecee62840706a0356388ac8fe9b4284a02972fb121a316518aa6" from cache
/: (run (shell "rm -rf ~/.opam && opam init -ya --bare ~/opam-repository"))
No configuration file found, using built-in defaults.
Checking for available remotes: rsync and local, git.
- you won't be able to use mercurial repositories unless you install the hg command on your system.
- you won't be able to use darcs repositories unless you install the darcs command on your system.
<><> Fetching repository information ><><><><><><><><><><><><><><><><><><><><><>
[default] Initialised
User configuration:
/usr/home/opam/.profile is already up-to-date.
[NOTE] Make sure that /usr/home/opam/.profile is well sourced in your ~/.bashrc.
2023-11-01 16:31.31 ---> using "3d69dd19638d580f9a84afa315c8a62fa2810666d83257cb65ea0af54a8f6211" from cache
/: (run (cache (opam-archives (target /usr/home/opam/.opam/download-cache)))
(network host)
(shell "opam switch create --repositories=default '5.1.0' 'ocaml-base-compiler.5.1.0'"))
<><> Installing new switch packages <><><><><><><><><><><><><><><><><><><><><><>
Switch invariant: ["ocaml-base-compiler" {= "5.1.0"}]
<><> Processing actions <><><><><><><><><><><><><><><><><><><><><><><><><><><><>
-> installed base-bigarray.base
-> installed base-threads.base
-> installed base-unix.base
-> installed ocaml-options-vanilla.1
-> retrieved ocaml-base-compiler.5.1.0 (https://github.com/ocaml/ocaml/archive/5.1.0.tar.gz)
-> installed ocaml-base-compiler.5.1.0
-> installed ocaml-config.3
-> installed ocaml.5.1.0
-> installed base-domains.base
-> installed base-nnp.base
Done.
# Run eval $(opam env --switch=5.1.0) to update the current shell environment
2023-11-01 16:31.31 ---> using "4d14f892c8031ddfa16535e34e750068d1ecfde9d7023af826fa837a9a24e19b" from cache
/: (run (network host)
(shell "opam update --depexts"))
[WARNING] Unknown update command for bsd, skipping system update
2023-11-01 16:31.32 ---> using "5ae8e2574f1a4212f30d2d30a11aaa2f3fb04d584b1c4315437c02c59acafd50" from cache
/: (run (cache (opam-archives (target /usr/home/opam/.opam/download-cache)))
(network host)
(shell "\
\nopam remove -y \"randoml.0.1.5\"\
\nopam install -vy \"randoml.0.1.5\"\
\nres=$?\
\nif [ $res = 31 ]; then\
\n if opam show -f x-ci-accept-failures: \"randoml.0.1.5\" | grep -q '\"freebsd\"'; then\
\n echo \"This package failed and has been disabled for CI using the 'x-ci-accept-failures' field.\"\
\n exit 69\
\n fi\
\nfi\
\n\
\n\
\nexit $res\
\n"))
[NOTE] randoml.0.1.5 is not installed.
Nothing to do.
The following actions will be performed:
- install ocamlfind 1.9.6 [required by zarith]
- install conf-gmp 4 [required by zarith]
- install conf-rust-2018 1 [required by randoml]
- install seq base [required by re]
- install dune 3.11.1 [required by randoml]
- install num 1.4 [required by bignum]
- install zarith 1.13 [required by bignum]
- install zarith_stubs_js v0.16.0 [required by bignum]
- install stdlib-shims 0.3.0 [required by ppxlib]
- install sexplib0 v0.16.0 [required by base]
- install re 1.11.0 [required by ppx_expect]
- install ppx_derivers 1.2.1 [required by ppxlib]
- install ocaml-compiler-libs v0.12.4 [required by ppxlib]
- install jane-street-headers v0.16.0 [required by core]
- install csexp 1.5.2 [required by dune-configurator]
- install parsexp v0.16.0 [required by sexplib]
- install ppxlib 0.31.0 [required by ppx_jane]
- install dune-configurator 3.11.1 [required by base]
- install sexplib v0.16.0 [required by core]
- install ppx_pipebang v0.16.0 [required by ppx_jane]
- install ppx_ignore_instrumentation v0.16.0 [required by ppx_jane]
- install base v0.16.3 [required by core_kernel]
- install variantslib v0.16.0 [required by core]
- install typerep v0.16.0 [required by bignum]
- install stdio v0.16.0 [required by core]
- install ppx_tydi v0.16.0 [required by ppx_jane]
- install ppx_stable_witness v0.16.0 [required by ppx_jane]
- install ppx_stable v0.16.0 [required by ppx_jane]
- install ppx_sexp_conv v0.16.0 [required by core]
- install ppx_optional v0.16.0 [required by ppx_jane]
- install ppx_here v0.16.0 [required by ppx_jane]
- install ppx_globalize v0.16.0 [required by ppx_base]
- install ppx_fixed_literal v0.16.0 [required by ppx_jane]
- install ppx_enumerate v0.16.0 [required by ppx_base]
- install ppx_disable_unused_warnings v0.16.0 [required by ppx_jane]
- install ppx_compare v0.16.0 [required by ppx_base, bin_prot]
- install ppx_cold v0.16.0 [required by ppx_base]
- install fieldslib v0.16.0 [required by core]
- install ppx_variants_conv v0.16.0 [required by ppx_jane]
- install ppx_typerep_conv v0.16.0 [required by ppx_jane]
- install ppx_optcomp v0.16.0 [required by core_kernel]
- install ppx_custom_printf v0.16.0 [required by ppx_jane]
- install ppx_sexp_value v0.16.0 [required by ppx_jane]
- install ppx_sexp_message v0.16.0 [required by core]
- install ppx_let v0.16.0 [required by ppx_jane]
- install ppx_hash v0.16.0 [required by core]
- install ppx_assert v0.16.0 [required by core]
- install ppx_fields_conv v0.16.0 [required by ppx_jane]
- install ppx_log v0.16.0 [required by ppx_jane]
- install ppx_base v0.16.0 [required by core]
- install jst-config v0.16.0 [required by core]
- install bin_prot v0.16.0 [required by core]
- install ppx_string v0.16.0 [required by ppx_jane]
- install time_now v0.16.0 [required by core]
- install ppx_bin_prot v0.16.0 [required by ppx_jane]
- install ppx_module_timer v0.16.0 [required by ppx_jane]
- install ppx_inline_test v0.16.1 [required by randoml]
- install ppx_expect v0.16.0 [required by ppx_jane]
- install ppx_bench v0.16.0 [required by ppx_jane]
- install splittable_random v0.16.0 [required by bignum]
- install base_quickcheck v0.16.0 [required by core]
- install ppx_jane v0.16.0 [required by bignum, core_kernel]
- install int_repr v0.16.0 [required by core_kernel]
- install base_bigstring v0.16.0 [required by core]
- install core v0.16.2 [required by bignum, core_kernel]
- install core_kernel v0.16.0 [required by randoml]
- install bignum v0.16.0 [required by randoml]
- install randoml 0.1.5
===== 68 to install =====
The following system packages will first need to be installed:
gmp rust
<><> Handling external dependencies <><><><><><><><><><><><><><><><><><><><><><>
Let opam run your package manager to install the required system packages?
(answer 'n' for other options) [Y/n] y
+ /usr/local/bin/sudo "pkg" "install" "-y" "gmp" "rust"
- Updating FreeBSD repository catalogue...
- [summer] Fetching packagesite.pkg: .......... done
- Processing entries:
- .
- ..
- .
- .
- .
- .
- .
- .
- . done
- FreeBSD repository update completed. 34071 packages processed.
- All repositories are up to date.
- New version of pkg detected; it needs to be installed first.
- The following 1 package(s) will be affected (of 0 checked):
-
- Installed packages to be UPGRADED:
- pkg: 1.19.2 -> 1.20.8
-
- Number of packages to be upgraded: 1
-
- The process will require 1 MiB more space.
- 9 MiB to be downloaded.
- [summer] [1/1] Fetching pkg-1.20.8.pkg:
- ..
- ..
- ...
- ..
- . done
- Checking integrity... done (0 conflicting)
- [summer] [1/1] Upgrading pkg from 1.19.2 to 1.20.8...
- [summer] [1/1] Extracting pkg-1.20.8: .........
- . done
- Updating FreeBSD repository catalogue...
- FreeBSD repository is up to date.
- All repositories are up to date.
- The following 2 package(s) will be affected (of 0 checked):
-
- New packages to be INSTALLED:
- gmp: 6.3.0
- rust: 1.72.0
-
- Number of packages to be installed: 2
-
- The process will require 1 GiB more space.
- 130 MiB to be downloaded.
- [summer] [1/2] Fetching rust-1.72.0.pkg:
- .
- .
- ..
- .
- ..
- ..
- . done
- [summer] [2/2] Fetching gmp-6.3.0.pkg: .......... done
- Checking integrity...
- done (0 conflicting)
- [summer] [1/2] Installing rust-1.72.0...
- [summer] [1/2] Extracting rust-1.72.0:
- ...
- .
- ..
- ..
- .
- . done
- [summer] [2/2] Installing gmp-6.3.0...
- [summer] [2/2] Extracting gmp-6.3.0: .......... done
<><> Processing actions <><><><><><><><><><><><><><><><><><><><><><><><><><><><>
Processing 1/204:
Processing 2/204:
Processing 3/204:
-> retrieved base_bigstring.v0.16.0 (cached)
Processing 4/204:
-> retrieved base_quickcheck.v0.16.0 (cached)
Processing 5/204:
-> retrieved bignum.v0.16.0 (cached)
Processing 6/204:
Processing 7/204:
Processing 8/204:
Processing 9/204: [conf-gmp: sh]
Processing 10/204: [conf-gmp: sh] [conf-rust-2018: cargo]
-> retrieved core.v0.16.2 (cached)
Processing 11/204: [conf-gmp: sh] [conf-rust-2018: cargo]
-> retrieved bin_prot.v0.16.0 (cached)
Processing 12/204: [conf-gmp: sh] [conf-rust-2018: cargo]
-> retrieved base.v0.16.3 (cached)
Processing 13/204: [conf-gmp: sh] [conf-rust-2018: cargo]
-> retrieved csexp.1.5.2 (cached)
Processing 14/204: [conf-gmp: sh] [conf-rust-2018: cargo]
-> retrieved core_kernel.v0.16.0 (cached)
Processing 15/204: [conf-gmp: sh] [conf-rust-2018: cargo]
- cargo 1.72.0
Processing 15/204: [conf-gmp: sh] [conf-rust-2018: rustc 2018]
-> retrieved fieldslib.v0.16.0 (cached)
Processing 16/204: [conf-gmp: sh] [conf-rust-2018: rustc 2018]
-> retrieved dune.3.11.1 (cached)
Processing 17/204: [conf-gmp: sh] [conf-rust-2018: rustc 2018]
Processing 18/204: [conf-gmp: sh] [conf-rust-2018: rustc 2018] [dune: ocaml 15]
-> retrieved jane-street-headers.v0.16.0 (cached)
Processing 19/204: [conf-gmp: sh] [conf-rust-2018: rustc 2018] [dune: ocaml 15]
-> retrieved int_repr.v0.16.0 (cached)
Processing 20/204: [conf-gmp: sh] [conf-rust-2018: rustc 2018] [dune: ocaml 15]
-> retrieved jst-config.v0.16.0 (cached)
Processing 21/204: [conf-gmp: sh] [conf-rust-2018: rustc 2018] [dune: ocaml 15]
-> retrieved num.1.4 (cached)
Processing 22/204: [conf-gmp: sh] [conf-rust-2018: rustc 2018] [dune: ocaml 15]
-> retrieved ocaml-compiler-libs.v0.12.4 (cached)
Processing 23/204: [conf-gmp: sh] [conf-rust-2018: rustc 2018] [dune: ocaml 15]
-> retrieved ocamlfind.1.9.6 (cached)
Processing 24/204: [conf-gmp: sh] [conf-rust-2018: rustc 2018] [dune: ocaml 15]
[ocamlfind: patch] applying 0001-Harden-test-for-OCaml-5.patch
Processing 25/204: [conf-gmp: sh] [conf-rust-2018: rustc 2018] [dune: ocaml 15] [ocamlfind: patch]
-> retrieved ppx_assert.v0.16.0 (cached)
Processing 26/204: [conf-gmp: sh] [conf-rust-2018: rustc 2018] [dune: ocaml 15] [ocamlfind: patch]
Processing 26/204: [conf-gmp: sh] [conf-rust-2018: rustc 2018] [dune: ocaml 15] [ocamlfind: ./configure]
-> retrieved parsexp.v0.16.0 (cached)
Processing 27/204: [conf-gmp: sh] [conf-rust-2018: rustc 2018] [dune: ocaml 15] [ocamlfind: ./configure]
-> retrieved ppx_base.v0.16.0 (cached)
Processing 28/204: [conf-gmp: sh] [conf-rust-2018: rustc 2018] [dune: ocaml 15] [ocamlfind: ./configure]
-> retrieved ppx_bench.v0.16.0 (cached)
Processing 29/204: [conf-gmp: sh] [conf-rust-2018: rustc 2018] [dune: ocaml 15] [ocamlfind: ./configure]
-> retrieved ppx_bin_prot.v0.16.0 (cached)
Processing 30/204: [conf-gmp: sh] [conf-rust-2018: rustc 2018] [dune: ocaml 15] [ocamlfind: ./configure]
-> retrieved ppx_cold.v0.16.0 (cached)
Processing 31/204: [conf-gmp: sh] [conf-rust-2018: rustc 2018] [dune: ocaml 15] [ocamlfind: ./configure]
-> retrieved ppx_compare.v0.16.0 (cached)
Processing 32/204: [conf-gmp: sh] [conf-rust-2018: rustc 2018] [dune: ocaml 15] [ocamlfind: ./configure]
-> retrieved ppx_custom_printf.v0.16.0 (cached)
Processing 33/204: [conf-gmp: sh] [conf-rust-2018: rustc 2018] [dune: ocaml 15] [ocamlfind: ./configure]
-> retrieved ppx_derivers.1.2.1 (cached)
Processing 34/204: [conf-gmp: sh] [conf-rust-2018: rustc 2018] [dune: ocaml 15] [ocamlfind: ./configure]
-> retrieved ppx_disable_unused_warnings.v0.16.0 (cached)
Processing 35/204: [conf-gmp: sh] [conf-rust-2018: rustc 2018] [dune: ocaml 15] [ocamlfind: ./configure]
-> retrieved ppx_enumerate.v0.16.0 (cached)
Processing 36/204: [conf-gmp: sh] [conf-rust-2018: rustc 2018] [dune: ocaml 15] [ocamlfind: ./configure]
-> retrieved ppx_expect.v0.16.0 (cached)
Processing 37/204: [conf-gmp: sh] [conf-rust-2018: rustc 2018] [dune: ocaml 15] [ocamlfind: ./configure]
-> retrieved ppx_fields_conv.v0.16.0 (cached)
Processing 38/204: [conf-gmp: sh] [conf-rust-2018: rustc 2018] [dune: ocaml 15] [ocamlfind: ./configure]
-> retrieved ppx_fixed_literal.v0.16.0 (cached)
Processing 39/204: [conf-gmp: sh] [conf-rust-2018: rustc 2018] [dune: ocaml 15] [ocamlfind: ./configure]
-> retrieved ppx_globalize.v0.16.0 (cached)
Processing 40/204: [conf-gmp: sh] [conf-rust-2018: rustc 2018] [dune: ocaml 15] [ocamlfind: ./configure]
-> retrieved ppx_hash.v0.16.0 (cached)
Processing 41/204: [conf-gmp: sh] [conf-rust-2018: rustc 2018] [dune: ocaml 15] [ocamlfind: ./configure]
-> retrieved ppx_here.v0.16.0 (cached)
Processing 42/204: [conf-gmp: sh] [conf-rust-2018: rustc 2018] [dune: ocaml 15] [ocamlfind: ./configure]
-> retrieved ppx_ignore_instrumentation.v0.16.0 (cached)
Processing 43/204: [conf-gmp: sh] [conf-rust-2018: rustc 2018] [dune: ocaml 15] [ocamlfind: ./configure]
-> retrieved ppx_inline_test.v0.16.1 (cached)
Processing 44/204: [conf-gmp: sh] [conf-rust-2018: rustc 2018] [dune: ocaml 15] [ocamlfind: ./configure]
-> retrieved ppx_jane.v0.16.0 (cached)
Processing 45/204: [conf-gmp: sh] [conf-rust-2018: rustc 2018] [dune: ocaml 15] [ocamlfind: ./configure]
-> retrieved ppx_let.v0.16.0 (cached)
Processing 46/204: [conf-gmp: sh] [conf-rust-2018: rustc 2018] [dune: ocaml 15] [ocamlfind: ./configure]
-> retrieved ppx_log.v0.16.0 (cached)
Processing 47/204: [conf-gmp: sh] [conf-rust-2018: rustc 2018] [dune: ocaml 15] [ocamlfind: ./configure]
-> retrieved ppx_module_timer.v0.16.0 (cached)
Processing 48/204: [conf-gmp: sh] [conf-rust-2018: rustc 2018] [dune: ocaml 15] [ocamlfind: ./configure]
-> retrieved ppx_optcomp.v0.16.0 (cached)
Processing 49/204: [conf-gmp: sh] [conf-rust-2018: rustc 2018] [dune: ocaml 15] [ocamlfind: ./configure]
-> retrieved ppx_optional.v0.16.0 (cached)
Processing 50/204: [conf-gmp: sh] [conf-rust-2018: rustc 2018] [dune: ocaml 15] [ocamlfind: ./configure]
-> retrieved ppx_pipebang.v0.16.0 (cached)
Processing 51/204: [conf-gmp: sh] [conf-rust-2018: rustc 2018] [dune: ocaml 15] [ocamlfind: ./configure]
-> retrieved ppx_sexp_conv.v0.16.0 (cached)
Processing 52/204: [conf-gmp: sh] [conf-rust-2018: rustc 2018] [dune: ocaml 15] [ocamlfind: ./configure]
-> retrieved ppx_sexp_message.v0.16.0 (cached)
Processing 53/204: [conf-gmp: sh] [conf-rust-2018: rustc 2018] [dune: ocaml 15] [ocamlfind: ./configure]
-> retrieved ppx_sexp_value.v0.16.0 (cached)
Processing 54/204: [conf-gmp: sh] [conf-rust-2018: rustc 2018] [dune: ocaml 15] [ocamlfind: ./configure]
-> retrieved ppx_stable.v0.16.0 (cached)
Processing 55/204: [conf-gmp: sh] [conf-rust-2018: rustc 2018] [dune: ocaml 15] [ocamlfind: ./configure]
-> retrieved ppx_stable_witness.v0.16.0 (cached)
Processing 56/204: [conf-gmp: sh] [conf-rust-2018: rustc 2018] [dune: ocaml 15] [ocamlfind: ./configure]
-> retrieved ppx_string.v0.16.0 (cached)
Processing 57/204: [conf-gmp: sh] [conf-rust-2018: rustc 2018] [dune: ocaml 15] [ocamlfind: ./configure]
-> retrieved ppx_tydi.v0.16.0 (cached)
Processing 58/204: [conf-gmp: sh] [conf-rust-2018: rustc 2018] [dune: ocaml 15] [ocamlfind: ./configure]
-> retrieved ppx_typerep_conv.v0.16.0 (cached)
Processing 59/204: [conf-gmp: sh] [conf-rust-2018: rustc 2018] [dune: ocaml 15] [ocamlfind: ./configure]
-> retrieved ppx_variants_conv.v0.16.0 (cached)
Processing 60/204: [randoml.0.1.5: http] [conf-gmp: sh] [conf-rust-2018: rustc 2018] [dune: ocaml 15] [ocamlfind: ./configure]
- Welcome to findlib version 1.9.6
- Configuring core...
- Checking for #remove_directory...
- Testing threading model...
- systhread_supported: true
- Testing DLLs...
- Testing whether ppxopt can be supported...
- Checking for ocamlc -opaque...
- Checking for ocamlopt -g...
- Configuring libraries...
- unix: found (in +unix)
- dynlink: found (in +dynlink)
- bigarray: not present (possible since 4.08)
- compiler-libs: found
- dbm: not present (normal since 4.00)
- graphics: not present (normal since 4.09)
- num: not present (normal since 4.06)
- ocamlbuild: not present (normal since 4.03)
- ocamldoc: found (in +ocamldoc)
- raw_spacetime: not present (normal since 4.12)
- threads: found (in +threads)
- str: found (in +str)
- labltk: not present (normal since 4.02)
- native dynlink: found
- camlp4: disabled
- bytes: found, installing fake library
- Configuration for bytes written to site-lib-src/bytes/META
- Detecting compiler arguments: (extractor built) ok
-
- About the OCAML core installation:
- Standard library: /usr/home/opam/.opam/5.1.0/lib/ocaml
- Binaries: /usr/home/opam/.opam/5.1.0/bin
- Manual pages: /usr/home/opam/.opam/5.1.0/man
- Multi-threading type: posix
- The directory of site-specific packages will be
- site-lib: /usr/home/opam/.opam/5.1.0/lib
- The configuration file is written to:
- findlib config file: /usr/home/opam/.opam/5.1.0/lib/findlib.conf
- Software will be installed:
- Libraries: in <site-lib>/findlib
- Binaries: /usr/home/opam/.opam/5.1.0/bin
- Manual pages: /usr/home/opam/.opam/5.1.0/man
- topfind script: /usr/home/opam/.opam/5.1.0/lib/ocaml
- Topfind ppxopt support: yes
- Toolbox: no
- Link custom runtime: no
- Need bytes compatibility: no
-
- Configuration has been written to Makefile.config
-
- You can now do 'make all', and optionally 'make opt', to build ocamlfind.
Processing 60/204: [randoml.0.1.5: http] [conf-gmp: sh] [conf-rust-2018: rustc 2018] [dune: ocaml 15] [ocamlfind: gmake all]
-> compiled conf-rust-2018.1
Processing 60/204: [randoml.0.1.5: http] [conf-gmp: sh] [dune: ocaml 15] [ocamlfind: gmake all]
-> installed conf-rust-2018.1
Processing 61/204: [randoml.0.1.5: http] [conf-gmp: sh] [dune: ocaml 15] [ocamlfind: gmake all]
-> retrieved dune-configurator.3.11.1 (cached)
Processing 62/204: [randoml.0.1.5: http] [conf-gmp: sh] [dune: ocaml 15] [ocamlfind: gmake all]
Processing 62/204: [conf-gmp: sh] [dune: ocaml 15] [ocamlfind: gmake all]
-> retrieved re.1.11.0 (cached)
Processing 63/204: [conf-gmp: sh] [dune: ocaml 15] [ocamlfind: gmake all]
Processing 64/204: [conf-gmp: sh] [dune: ocaml 15] [ocamlfind: gmake all]
Processing 65/204: [conf-gmp: sh] [dune: ocaml 15] [ocamlfind: gmake all]
-> installed seq.base
Processing 66/204: [conf-gmp: sh] [dune: ocaml 15] [ocamlfind: gmake all]
-> retrieved sexplib.v0.16.0 (cached)
Processing 67/204: [conf-gmp: sh] [dune: ocaml 15] [ocamlfind: gmake all]
-> retrieved randoml.0.1.5 (https://github.com/mimoo/randoml/releases/download/0.1.5/randoml-0.1.5.tbz)
Processing 68/204: [conf-gmp: sh] [dune: ocaml 15] [ocamlfind: gmake all]
-> retrieved sexplib0.v0.16.0 (cached)
Processing 69/204: [conf-gmp: sh] [dune: ocaml 15] [ocamlfind: gmake all]
-> retrieved splittable_random.v0.16.0 (cached)
Processing 70/204: [conf-gmp: sh] [dune: ocaml 15] [ocamlfind: gmake all]
-> retrieved stdio.v0.16.0 (cached)
Processing 71/204: [conf-gmp: sh] [dune: ocaml 15] [ocamlfind: gmake all]
-> retrieved stdlib-shims.0.3.0 (cached)
Processing 72/204: [conf-gmp: sh] [dune: ocaml 15] [ocamlfind: gmake all]
-> retrieved time_now.v0.16.0 (cached)
Processing 73/204: [conf-gmp: sh] [dune: ocaml 15] [ocamlfind: gmake all]
-> retrieved typerep.v0.16.0 (cached)
Processing 74/204: [conf-gmp: sh] [dune: ocaml 15] [ocamlfind: gmake all]
-> retrieved variantslib.v0.16.0 (cached)
Processing 75/204: [conf-gmp: sh] [dune: ocaml 15] [ocamlfind: gmake all]
-> retrieved zarith.1.13 (cached)
-> retrieved zarith_stubs_js.v0.16.0 (cached)
- for p in findlib; do ( cd src/$p; /usr/local/bin/gmake all ) || exit; done
- gmake[1]: Entering directory '/usr/home/opam/.opam/5.1.0/.opam-switch/build/ocamlfind.1.9.6/src/findlib'
- ocamllex fl_meta.mll
- 22 states, 392 transitions, table size 1700 bytes
- USE_CYGPATH="0"; \
- export USE_CYGPATH; \
- cat findlib_config.mlp | \
- ../../tools/patch '@CONFIGFILE@' '/usr/home/opam/.opam/5.1.0/lib/findlib.conf' | \
- ../../tools/patch '@STDLIB@' '/usr/home/opam/.opam/5.1.0/lib/ocaml' | \
- sed -e 's;@AUTOLINK@;true;g' \
- -e 's;@SYSTEM@;freebsd;g' \
- >findlib_config.ml
- if [ "true" = "true" ]; then \
- cp topfind.ml.in topfind.ml; \
- else \
- sed -e '/PPXOPT_BEGIN/,/PPXOPT_END/ d' topfind.ml.in \
- > topfind.ml ; \
- fi
- ocamldep *.ml *.mli >depend
- ocamlc -I +compiler-libs -opaque -I +unix -I +dynlink -g -c findlib_config.ml
- ocamlc -I +compiler-libs -opaque -I +unix -I +dynlink -g -c fl_split.ml
- ocamlc -I +compiler-libs -opaque -I +unix -I +dynlink -g -c fl_metatoken.ml
- ocamlc -I +compiler-libs -opaque -I +unix -I +dynlink -g -c fl_meta.ml
- ocamlc -I +compiler-libs -opaque -I +unix -I +dynlink -c fl_metascanner.mli
- ocamlc -I +compiler-libs -opaque -I +unix -I +dynlink -g -c fl_metascanner.ml
- ocamlc -I +compiler-libs -opaque -I +unix -I +dynlink -c fl_topo.mli
- ocamlc -I +compiler-libs -opaque -I +unix -I +dynlink -g -c fl_topo.ml
- ocamlc -I +compiler-libs -opaque -I +unix -I +dynlink -c fl_package_base.mli
- ocamlc -I +compiler-libs -opaque -I +unix -I +dynlink -g -c fl_package_base.ml
- File "fl_package_base.ml", line 304, characters 22-40:
- 304 | let pkg_ancestors = query_requirements predlist pkg in
- ^^^^^^^^^^^^^^^^^^
- Warning 6 [labels-omitted]: label preds was omitted in the application of this function.
-
- File "fl_package_base.ml", line 350, characters 18-36:
- 350 | let ancestors = query_requirements predlist package_name in
- ^^^^^^^^^^^^^^^^^^
- Warning 6 [labels-omitted]: label preds was omitted in the application of this function.
-
- File "fl_package_base.ml", line 375, characters 23-41:
- 375 | let pkg_ancestors = query_requirements predlist pkg in
- ^^^^^^^^^^^^^^^^^^
- Warning 6 [labels-omitted]: label preds was omitted in the application of this function.
-
- File "fl_package_base.ml", line 510, characters 16-35:
- 510 | ( let c = package_definitions search_path pkg.package_name in
- ^^^^^^^^^^^^^^^^^^^
- Warning 6 [labels-omitted]: label search_path was omitted in the application of this function.
- ocamlc -I +compiler-libs -opaque -I +unix -I +dynlink -c findlib.mli
- ocamlc -I +compiler-libs -opaque -I +unix -I +dynlink -g -c findlib.ml
- File "findlib.ml", line 390, characters 2-26:
- 390 | Fl_package_base.requires predlist pkg
- ^^^^^^^^^^^^^^^^^^^^^^^^
- Warning 6 [labels-omitted]: label preds was omitted in the application of this function.
-
- File "findlib.ml", line 396, characters 2-33:
- 396 | Fl_package_base.requires_deeply predlist pkglist
- ^^^^^^^^^^^^^^^^^^^^^^^^^^^^^^^
- Warning 6 [labels-omitted]: label preds was omitted in the application of this function.
- ocamlc -I +compiler-libs -opaque -I +unix -I +dynlink -g -c fl_args.ml
- ocamlc -I +compiler-libs -opaque -I +unix -I +dynlink -g -c fl_lint.ml
- ocamlc -I +compiler-libs -a -o findlib.cma findlib_config.cmo fl_split.cmo fl_metatoken.cmo fl_meta.cmo fl_metascanner.cmo fl_topo.cmo fl_package_base.cmo findlib.cmo fl_args.cmo fl_lint.cmo
- ocamlc -I +compiler-libs -opaque -I +unix -I +dynlink -g -c ocaml_args.ml
- ocamlc -I +compiler-libs -opaque -I +unix -I +dynlink -g -c frontend.ml
- File "frontend.ml", line 859, characters 10-39:
- 859 | Fl_package_base.package_users predicates1 packages1
- ^^^^^^^^^^^^^^^^^^^^^^^^^^^^^
- Warning 6 [labels-omitted]: label preds was omitted in the application of this function.
- ocamlc -I +compiler-libs -o ocamlfind -g findlib.cma unix.cma \
- -I +unix -I +dynlink ocaml_args.cmo frontend.cmo
- ocamlc -I +compiler-libs -opaque -I +unix -I +dynlink -c topfind.mli
- ocamlc -I +compiler-libs -opaque -I +unix -I +dynlink -g -c topfind.ml
- File "topfind.ml", line 128, characters 40-63:
- 128 | match Hashtbl.find Toploop.directive_table "ppx" with
- ^^^^^^^^^^^^^^^^^^^^^^^
- Alert deprecated: Toploop.directive_table
-
- File "topfind.ml", line 258, characters 4-27:
- 258 | Toploop.directive_table
- ^^^^^^^^^^^^^^^^^^^^^^^
- Alert deprecated: Toploop.directive_table
-
- File "topfind.ml", line 268, characters 4-27:
- 268 | Toploop.directive_table
- ^^^^^^^^^^^^^^^^^^^^^^^
- Alert deprecated: Toploop.directive_table
-
- File "topfind.ml", line 280, characters 4-27:
- 280 | Toploop.directive_table
- ^^^^^^^^^^^^^^^^^^^^^^^
- Alert deprecated: Toploop.directive_table
-
- File "topfind.ml", line 293, characters 4-27:
- 293 | Toploop.directive_table
- ^^^^^^^^^^^^^^^^^^^^^^^
- Alert deprecated: Toploop.directive_table
-
- File "topfind.ml", line 307, characters 4-27:
- 307 | Toploop.directive_table
- ^^^^^^^^^^^^^^^^^^^^^^^
- Alert deprecated: Toploop.directive_table
-
- File "topfind.ml", line 319, characters 4-27:
- 319 | Toploop.directive_table
- ^^^^^^^^^^^^^^^^^^^^^^^
- Alert deprecated: Toploop.directive_table
- ocamlc -I +compiler-libs -a -o findlib_top.cma topfind.cmo
- USE_CYGPATH="0"; \
- export USE_CYGPATH; \
- cat topfind_rd1.p | \
- ../../tools/patch '@SITELIB@' '/usr/home/opam/.opam/5.1.0/lib' \
- >topfind
- ocamlc -I +compiler-libs -opaque -I +unix -I +dynlink -c fl_dynload.mli
- ocamlc -I +compiler-libs -opaque -I +unix -I +dynlink -g -c fl_dynload.ml
- ocamlc -I +compiler-libs -a -o findlib_dynload.cma fl_dynload.cmo
- gmake[1]: Leaving directory '/usr/home/opam/.opam/5.1.0/.opam-switch/build/ocamlfind.1.9.6/src/findlib'
- /usr/local/bin/gmake all-config
- gmake[1]: Entering directory '/usr/home/opam/.opam/5.1.0/.opam-switch/build/ocamlfind.1.9.6'
- USE_CYGPATH="0"; \
- export USE_CYGPATH; \
- cat findlib.conf.in | \
- tools/patch '@SITELIB@' '/usr/home/opam/.opam/5.1.0/lib' | \
- tools/patch '@FINDLIB_PATH@' '/usr/home/opam/.opam/5.1.0/lib/ocaml:/usr/home/opam/.opam/5.1.0/lib' -p >findlib.conf
- if ./tools/cmd_from_same_dir ocamlc; then \
- echo 'ocamlc="ocamlc.opt"' >>findlib.conf; \
- fi
- if ./tools/cmd_from_same_dir ocamlopt; then \
- echo 'ocamlopt="ocamlopt.opt"' >>findlib.conf; \
- fi
- if ./tools/cmd_from_same_dir ocamldep; then \
- echo 'ocamldep="ocamldep.opt"' >>findlib.conf; \
- fi
- if ./tools/cmd_from_same_dir ocamldoc; then \
- echo 'ocamldoc="ocamldoc.opt"' >>findlib.conf; \
- fi
- gmake[1]: Leaving directory '/usr/home/opam/.opam/5.1.0/.opam-switch/build/ocamlfind.1.9.6'
Processing 75/204: [conf-gmp: sh] [dune: ocaml 15] [ocamlfind: gmake opt]
-> retrieved ppxlib.0.31.0 (cached)
- + cc -c -I/usr/local/include test.c
-> compiled conf-gmp.4
Processing 75/204: [dune: ocaml 15] [ocamlfind: gmake opt]
-> installed conf-gmp.4
Processing 76/204: [dune: ocaml 15] [ocamlfind: gmake opt]
- for p in findlib; do ( cd src/$p; /usr/local/bin/gmake opt ) || exit; done
- gmake[1]: Entering directory '/usr/home/opam/.opam/5.1.0/.opam-switch/build/ocamlfind.1.9.6/src/findlib'
- ocamlopt -I +compiler-libs -g -opaque -I +unix -I +dynlink -c findlib_config.ml
- ocamlopt -I +compiler-libs -g -opaque -I +unix -I +dynlink -c fl_split.ml
- ocamlopt -I +compiler-libs -g -opaque -I +unix -I +dynlink -c fl_metatoken.ml
- ocamlopt -I +compiler-libs -g -opaque -I +unix -I +dynlink -c fl_meta.ml
- ocamlopt -I +compiler-libs -g -opaque -I +unix -I +dynlink -c fl_metascanner.ml
- ocamlopt -I +compiler-libs -g -opaque -I +unix -I +dynlink -c fl_topo.ml
- ocamlopt -I +compiler-libs -g -opaque -I +unix -I +dynlink -c fl_package_base.ml
- File "fl_package_base.ml", line 304, characters 22-40:
- 304 | let pkg_ancestors = query_requirements predlist pkg in
- ^^^^^^^^^^^^^^^^^^
- Warning 6 [labels-omitted]: label preds was omitted in the application of this function.
-
- File "fl_package_base.ml", line 350, characters 18-36:
- 350 | let ancestors = query_requirements predlist package_name in
- ^^^^^^^^^^^^^^^^^^
- Warning 6 [labels-omitted]: label preds was omitted in the application of this function.
-
- File "fl_package_base.ml", line 375, characters 23-41:
- 375 | let pkg_ancestors = query_requirements predlist pkg in
- ^^^^^^^^^^^^^^^^^^
- Warning 6 [labels-omitted]: label preds was omitted in the application of this function.
-
- File "fl_package_base.ml", line 510, characters 16-35:
- 510 | ( let c = package_definitions search_path pkg.package_name in
- ^^^^^^^^^^^^^^^^^^^
- Warning 6 [labels-omitted]: label search_path was omitted in the application of this function.
- ocamlopt -I +compiler-libs -g -opaque -I +unix -I +dynlink -c findlib.ml
- File "findlib.ml", line 390, characters 2-26:
- 390 | Fl_package_base.requires predlist pkg
- ^^^^^^^^^^^^^^^^^^^^^^^^
- Warning 6 [labels-omitted]: label preds was omitted in the application of this function.
-
- File "findlib.ml", line 396, characters 2-33:
- 396 | Fl_package_base.requires_deeply predlist pkglist
- ^^^^^^^^^^^^^^^^^^^^^^^^^^^^^^^
- Warning 6 [labels-omitted]: label preds was omitted in the application of this function.
- ocamlopt -I +compiler-libs -g -opaque -I +unix -I +dynlink -c fl_args.ml
- ocamlopt -I +compiler-libs -g -opaque -I +unix -I +dynlink -c fl_lint.ml
- ocamlopt -I +compiler-libs -g -a -o findlib.cmxa findlib_config.cmx fl_split.cmx fl_metatoken.cmx fl_meta.cmx fl_metascanner.cmx fl_topo.cmx fl_package_base.cmx findlib.cmx fl_args.cmx fl_lint.cmx
- if [ 1 -gt 0 ]; then \
- ocamlopt -I +compiler-libs -g -shared -o findlib.cmxs findlib_config.cmx fl_split.cmx fl_metatoken.cmx fl_meta.cmx fl_metascanner.cmx fl_topo.cmx fl_package_base.cmx findlib.cmx fl_args.cmx fl_lint.cmx; \
- fi
- ocamlopt -I +compiler-libs -g -opaque -I +unix -I +dynlink -c ocaml_args.ml
- ocamlopt -I +compiler-libs -g -opaque -I +unix -I +dynlink -c frontend.ml
- File "frontend.ml", line 859, characters 10-39:
- 859 | Fl_package_base.package_users predicates1 packages1
- ^^^^^^^^^^^^^^^^^^^^^^^^^^^^^
- Warning 6 [labels-omitted]: label preds was omitted in the application of this function.
- ocamlopt -I +compiler-libs -g -o ocamlfind_opt findlib.cmxa unix.cmxa \
- -I +unix -I +dynlink ocaml_args.cmx frontend.cmx
- ocamlopt -I +compiler-libs -g -opaque -I +unix -I +dynlink -c topfind.ml
- File "topfind.ml", line 128, characters 40-63:
- 128 | match Hashtbl.find Toploop.directive_table "ppx" with
- ^^^^^^^^^^^^^^^^^^^^^^^
- Alert deprecated: Toploop.directive_table
-
- File "topfind.ml", line 258, characters 4-27:
- 258 | Toploop.directive_table
- ^^^^^^^^^^^^^^^^^^^^^^^
- Alert deprecated: Toploop.directive_table
-
- File "topfind.ml", line 268, characters 4-27:
- 268 | Toploop.directive_table
- ^^^^^^^^^^^^^^^^^^^^^^^
- Alert deprecated: Toploop.directive_table
-
- File "topfind.ml", line 280, characters 4-27:
- 280 | Toploop.directive_table
- ^^^^^^^^^^^^^^^^^^^^^^^
- Alert deprecated: Toploop.directive_table
-
- File "topfind.ml", line 293, characters 4-27:
- 293 | Toploop.directive_table
- ^^^^^^^^^^^^^^^^^^^^^^^
- Alert deprecated: Toploop.directive_table
-
- File "topfind.ml", line 307, characters 4-27:
- 307 | Toploop.directive_table
- ^^^^^^^^^^^^^^^^^^^^^^^
- Alert deprecated: Toploop.directive_table
-
- File "topfind.ml", line 319, characters 4-27:
- 319 | Toploop.directive_table
- ^^^^^^^^^^^^^^^^^^^^^^^
- Alert deprecated: Toploop.directive_table
- ocamlopt -I +compiler-libs -g -a -o findlib_top.cmxa topfind.cmx
- if [ 1 -gt 0 ]; then \
- ocamlopt -I +compiler-libs -g -shared -o findlib_top.cmxs topfind.cmx; \
- fi
- ocamlopt -I +compiler-libs -g -opaque -I +unix -I +dynlink -c fl_dynload.ml
- ocamlopt -I +compiler-libs -g -a -o findlib_dynload.cmxa fl_dynload.cmx
- if [ 1 -gt 0 ]; then \
- ocamlopt -I +compiler-libs -g -shared -o findlib_dynload.cmxs fl_dynload.cmx; \
- fi
- gmake[1]: Leaving directory '/usr/home/opam/.opam/5.1.0/.opam-switch/build/ocamlfind.1.9.6/src/findlib'
-> compiled ocamlfind.1.9.6
Processing 76/204: [dune: ocaml 15]
Processing 77/204: [dune: ocaml 15] [ocamlfind: gmake install]
- if [ "0" -eq 1 ]; then \
- for x in camlp4 dbm graphics labltk num ocamlbuild; do \
- if [ -f "/usr/home/opam/.opam/5.1.0/lib/$x/META" ]; then \
- if ! grep -Fq '[distributed with Ocaml]' "//usr/home/opam/.opam/5.1.0/lib/$x/META"; then \
- rm -f site-lib-src/$x/META; \
- fi; \
- fi; \
- done; \
- test -f "site-lib-src/num/META" || rm -f "site-lib-src/num-top/META"; \
- fi
- echo 'SITELIB_META =' > Makefile.packages.in
- for x in `ls site-lib-src`; do test ! -f "site-lib-src/$x/META" || echo $x >> Makefile.packages.in; done
- tr '\n' ' ' < Makefile.packages.in > Makefile.packages
- rm Makefile.packages.in
- install -d "/usr/home/opam/.opam/5.1.0/bin"
- install -d "/usr/home/opam/.opam/5.1.0/man"
- /usr/local/bin/gmake install-config
- gmake[1]: Entering directory '/usr/home/opam/.opam/5.1.0/.opam-switch/build/ocamlfind.1.9.6'
- install -d "`dirname \"/usr/home/opam/.opam/5.1.0/lib/findlib.conf\"`"
- test -f "/usr/home/opam/.opam/5.1.0/lib/findlib.conf" || install -c findlib.conf "/usr/home/opam/.opam/5.1.0/lib/findlib.conf"
- gmake[1]: Leaving directory '/usr/home/opam/.opam/5.1.0/.opam-switch/build/ocamlfind.1.9.6'
- for p in findlib; do ( cd src/$p; /usr/local/bin/gmake install ); done
- gmake[1]: Entering directory '/usr/home/opam/.opam/5.1.0/.opam-switch/build/ocamlfind.1.9.6/src/findlib'
- install -d "/usr/home/opam/.opam/5.1.0/lib/findlib"
- install -d "/usr/home/opam/.opam/5.1.0/bin"
- test 1 -eq 0 || install -d "/usr/home/opam/.opam/5.1.0/lib/ocaml"
- test 1 -eq 0 || install -c topfind "/usr/home/opam/.opam/5.1.0/lib/ocaml/"
- files=` ../../tools/collect_files ../../Makefile.config \
- findlib.cmi findlib.mli findlib.cma findlib.cmxa findlib.a findlib.cmxs \
- findlib_config.cmi findlib_config.ml topfind.cmi topfind.mli \
- fl_args.cmi fl_lint.cmi fl_meta.cmi fl_split.cmi fl_topo.cmi ocaml_args.cmi \
- fl_package_base.mli fl_package_base.cmi fl_metascanner.mli fl_metascanner.cmi \
- fl_metatoken.cmi findlib_top.cma findlib_top.cmxa findlib_top.a findlib_top.cmxs \
- findlib_dynload.cma findlib_dynload.cmxa findlib_dynload.a findlib_dynload.cmxs fl_dynload.mli fl_dynload.cmi \
- META` && \
- install -c $files "/usr/home/opam/.opam/5.1.0/lib/findlib/"
- f="ocamlfind"; { test -f ocamlfind_opt && f="ocamlfind_opt"; }; \
- install -c $f "/usr/home/opam/.opam/5.1.0/bin/ocamlfind"
- # the following "if" block is only needed for 4.00beta2
- if [ 1 -eq 0 -a -f "/usr/home/opam/.opam/5.1.0/lib/ocaml/compiler-libs/topdirs.cmi" ]; then \
- cd "/usr/home/opam/.opam/5.1.0/lib/ocaml/compiler-libs/"; \
- install -c topdirs.cmi toploop.cmi "/usr/home/opam/.opam/5.1.0/lib/findlib/"; \
- fi
- gmake[1]: Leaving directory '/usr/home/opam/.opam/5.1.0/.opam-switch/build/ocamlfind.1.9.6/src/findlib'
- /usr/local/bin/gmake install-meta
- gmake[1]: Entering directory '/usr/home/opam/.opam/5.1.0/.opam-switch/build/ocamlfind.1.9.6'
- for x in bytes ; do install -d "/usr/home/opam/.opam/5.1.0/lib/$x"; install -c site-lib-src/$x/META "/usr/home/opam/.opam/5.1.0/lib/$x/META.tmp" && mv "/usr/home/opam/.opam/5.1.0/lib/$x/META.tmp" "/usr/home/opam/.opam/5.1.0/lib/$x/META"; done
- install -d "/usr/home/opam/.opam/5.1.0/lib/findlib"; install -c Makefile.packages "/usr/home/opam/.opam/5.1.0/lib/findlib/Makefile.packages"
- gmake[1]: Leaving directory '/usr/home/opam/.opam/5.1.0/.opam-switch/build/ocamlfind.1.9.6'
- test ! -f 'site-lib-src/num-top/META' || { cd src/findlib; /usr/local/bin/gmake install-num-top; }
- test ! -f 'site-lib-src/camlp4/META' || install -c tools/safe_camlp4 "/usr/home/opam/.opam/5.1.0/bin"
- /usr/local/bin/gmake install-doc
- gmake[1]: Entering directory '/usr/home/opam/.opam/5.1.0/.opam-switch/build/ocamlfind.1.9.6'
- install -d "/usr/home/opam/.opam/5.1.0/man/man1" "/usr/home/opam/.opam/5.1.0/man/man3" "/usr/home/opam/.opam/5.1.0/man/man5"
- install -c doc/ref-man/ocamlfind.1 "/usr/home/opam/.opam/5.1.0/man/man1"
- install -c doc/ref-man/META.5 doc/ref-man/site-lib.5 doc/ref-man/findlib.conf.5 "/usr/home/opam/.opam/5.1.0/man/man5"
- gmake[1]: Leaving directory '/usr/home/opam/.opam/5.1.0/.opam-switch/build/ocamlfind.1.9.6'
-> installed ocamlfind.1.9.6
Processing 77/204: [dune: ocaml 15]
Processing 78/204: [dune: ocaml 15] [num: gmake]
Processing 79/204: [dune: ocaml 15] [num: gmake] [zarith: sh]
- + LDFLAGS=' -L/usr/local/lib' CFLAGS=' -I/usr/local/include' ./configure
- binary ocaml: found in /usr/home/opam/.opam/5.1.0/bin
- binary ocamlc: found in /usr/home/opam/.opam/5.1.0/bin
- binary ocamldep: found in /usr/home/opam/.opam/5.1.0/bin
- binary ocamlmklib: found in /usr/home/opam/.opam/5.1.0/bin
- binary ocamldoc: found in /usr/home/opam/.opam/5.1.0/bin
- binary ocamlopt: found in /usr/home/opam/.opam/5.1.0/bin
- checking compilation with ocamlc -O3 -Wall -Wextra -I/usr/local/include: working
- include caml/mlvalues.h: found
- library dynlink.cmxa: found
- binary ocamlfind: found in /usr/home/opam/.opam/5.1.0/bin
- OCaml's word size is 64
- package gmp: found
- OCaml supports -bin-annot to produce documentation
-
- detected configuration:
-
- native-code: yes
- dynamic linking: yes
- defines: -DHAS_GMP
- includes: -I/usr/home/opam/.opam/5.1.0/lib/ocaml -I/usr/local/include
- libraries: -L/usr/local/lib -lgmp
- linker options: -L/usr/local/lib
- C options: -O3 -Wall -Wextra -I/usr/local/include
- installation path: /usr/home/opam/.opam/5.1.0/lib
- installation method findlib
-
- configuration successful!
- now type "make" to build
- then type "make install" or "sudo make install" to install
Processing 79/204: [dune: ocaml 15] [num: gmake] [zarith: gmake]
- /usr/local/bin/gmake -C src all
- gmake[1]: Entering directory '/usr/home/opam/.opam/5.1.0/.opam-switch/build/num.1.4/src'
- ocamlc -ccopt -DBNG_ARCH_amd64 -c bng.c
- ocamlc -ccopt -DBNG_ARCH_amd64 -c nat_stubs.c
- ocamlmklib -oc nums bng.o nat_stubs.o
- ocamlc -w +a-4-9-41-42-44-45-48 -warn-error A -bin-annot -g -safe-string -strict-sequence -strict-formats -c int_misc.mli
- ocamlc -w +a-4-9-41-42-44-45-48 -warn-error A -bin-annot -g -safe-string -strict-sequence -strict-formats -c int_misc.ml
- ocamlc -w +a-4-9-41-42-44-45-48 -warn-error A -bin-annot -g -safe-string -strict-sequence -strict-formats -c nat.mli
- ocamlc -w +a-4-9-41-42-44-45-48 -warn-error A -bin-annot -g -safe-string -strict-sequence -strict-formats -c nat.ml
- ocamlc -w +a-4-9-41-42-44-45-48 -warn-error A -bin-annot -g -safe-string -strict-sequence -strict-formats -c big_int.mli
- ocamlc -w +a-4-9-41-42-44-45-48 -warn-error A -bin-annot -g -safe-string -strict-sequence -strict-formats -c big_int.ml
- ocamlc -w +a-4-9-41-42-44-45-48 -warn-error A -bin-annot -g -safe-string -strict-sequence -strict-formats -c arith_flags.mli
- ocamlc -w +a-4-9-41-42-44-45-48 -warn-error A -bin-annot -g -safe-string -strict-sequence -strict-formats -c arith_flags.ml
- ocamlc -w +a-4-9-41-42-44-45-48 -warn-error A -bin-annot -g -safe-string -strict-sequence -strict-formats -c ratio.mli
- ocamlc -w +a-4-9-41-42-44-45-48 -warn-error A -bin-annot -g -safe-string -strict-sequence -strict-formats -c ratio.ml
- ocamlc -w +a-4-9-41-42-44-45-48 -warn-error A -bin-annot -g -safe-string -strict-sequence -strict-formats -c num.mli
- ocamlc -w +a-4-9-41-42-44-45-48 -warn-error A -bin-annot -g -safe-string -strict-sequence -strict-formats -c num.ml
- ocamlc -w +a-4-9-41-42-44-45-48 -warn-error A -bin-annot -g -safe-string -strict-sequence -strict-formats -c arith_status.mli
- ocamlc -w +a-4-9-41-42-44-45-48 -warn-error A -bin-annot -g -safe-string -strict-sequence -strict-formats -c arith_status.ml
- ocamlmklib -o nums -oc nums -linkall int_misc.cmo nat.cmo big_int.cmo arith_flags.cmo ratio.cmo num.cmo arith_status.cmo
- ocamlopt -w +a-4-9-41-42-44-45-48 -warn-error A -bin-annot -g -safe-string -strict-sequence -strict-formats -c int_misc.ml
- ocamlopt -w +a-4-9-41-42-44-45-48 -warn-error A -bin-annot -g -safe-string -strict-sequence -strict-formats -c nat.ml
- ocamlopt -w +a-4-9-41-42-44-45-48 -warn-error A -bin-annot -g -safe-string -strict-sequence -strict-formats -c big_int.ml
- ocamlopt -w +a-4-9-41-42-44-45-48 -warn-error A -bin-annot -g -safe-string -strict-sequence -strict-formats -c arith_flags.ml
- ocamlopt -w +a-4-9-41-42-44-45-48 -warn-error A -bin-annot -g -safe-string -strict-sequence -strict-formats -c ratio.ml
- ocamlopt -w +a-4-9-41-42-44-45-48 -warn-error A -bin-annot -g -safe-string -strict-sequence -strict-formats -c num.ml
- ocamlopt -w +a-4-9-41-42-44-45-48 -warn-error A -bin-annot -g -safe-string -strict-sequence -strict-formats -c arith_status.ml
- ocamlmklib -o nums -oc nums -linkall int_misc.cmx nat.cmx big_int.cmx arith_flags.cmx ratio.cmx num.cmx arith_status.cmx
- ocamlopt -w +a-4-9-41-42-44-45-48 -warn-error A -bin-annot -g -safe-string -strict-sequence -strict-formats -I . -shared -o nums.cmxs nums.cmxa
- gmake[1]: Leaving directory '/usr/home/opam/.opam/5.1.0/.opam-switch/build/num.1.4/src'
- /usr/local/bin/gmake -C toplevel all
- gmake[1]: Entering directory '/usr/home/opam/.opam/5.1.0/.opam-switch/build/num.1.4/toplevel'
- ocamlc -I ../src -I +compiler-libs -w +a-4-9-41-42-44-45-48 -warn-error A -safe-string -strict-sequence -strict-formats -c num_top_printers.mli
- ocamlc -I ../src -I +compiler-libs -w +a-4-9-41-42-44-45-48 -warn-error A -safe-string -strict-sequence -strict-formats -c num_top_printers.ml
- ocamlc -I ../src -I +compiler-libs -w +a-4-9-41-42-44-45-48 -warn-error A -safe-string -strict-sequence -strict-formats -c num_top.mli
- ocamlc -I ../src -I +compiler-libs -w +a-4-9-41-42-44-45-48 -warn-error A -safe-string -strict-sequence -strict-formats -c num_top.ml
- ocamlc -I ../src -I +compiler-libs -w +a-4-9-41-42-44-45-48 -warn-error A -safe-string -strict-sequence -strict-formats -a -o num_top.cma num_top_printers.cmo num_top.cmo
- gmake[1]: Leaving directory '/usr/home/opam/.opam/5.1.0/.opam-switch/build/num.1.4/toplevel'
-> compiled num.1.4
Processing 79/204: [dune: ocaml 15] [zarith: gmake]
Processing 80/204: [dune: ocaml 15] [zarith: gmake] [num: ocamlfind remove]
- ocamlfind: [WARNING] No such file: /usr/home/opam/.opam/5.1.0/lib/num/META
- ocamlfind: [WARNING] No such file: /usr/home/opam/.opam/5.1.0/lib/num-top/META
Processing 80/204: [dune: ocaml 15] [zarith: gmake] [num: gmake install]
- /usr/local/bin/gmake -C src install
- gmake[1]: Entering directory '/usr/home/opam/.opam/5.1.0/.opam-switch/build/num.1.4/src'
- install -d /usr/home/opam/.opam/5.1.0/lib/ocaml
- sed -e 's/%%VERSION%%/1.4/g' META.in > META
- ocamlfind install num META
- Installed /usr/home/opam/.opam/5.1.0/lib/num/META
- rm -f META
- install -m 644 nums.cma libnums.a big_int.cmi nat.cmi num.cmi ratio.cmi arith_status.cmi big_int.mli nat.mli num.mli ratio.mli arith_status.mli big_int.cmti nat.cmti num.cmti ratio.cmti arith_status.cmti nums.cmxa nums.a int_misc.cmx nat.cmx big_int.cmx arith_flags.cmx ratio.cmx num.cmx arith_status.cmx nums.cmxs /usr/home/opam/.opam/5.1.0/lib/ocaml
- install -d /usr/home/opam/.opam/5.1.0/lib/ocaml/stublibs
- install dllnums.so /usr/home/opam/.opam/5.1.0/lib/ocaml/stublibs
- gmake[1]: Leaving directory '/usr/home/opam/.opam/5.1.0/.opam-switch/build/num.1.4/src'
- /usr/local/bin/gmake -C toplevel install
- gmake[1]: Entering directory '/usr/home/opam/.opam/5.1.0/.opam-switch/build/num.1.4/toplevel'
- sed -e 's/%%VERSION%%/1.4/g' META.in > META
- ocamlfind install num-top META num_top.cma num_top.cmi num_top_printers.cmi
- Installed /usr/home/opam/.opam/5.1.0/lib/num-top/num_top_printers.cmi
- Installed /usr/home/opam/.opam/5.1.0/lib/num-top/num_top.cmi
- Installed /usr/home/opam/.opam/5.1.0/lib/num-top/num_top.cma
- Installed /usr/home/opam/.opam/5.1.0/lib/num-top/META
- rm -f META
- gmake[1]: Leaving directory '/usr/home/opam/.opam/5.1.0/.opam-switch/build/num.1.4/toplevel'
-> installed num.1.4
Processing 80/204: [dune: ocaml 15] [zarith: gmake]
- (echo "let"; grep "version" META | head -1) > zarith_version.ml
- ocamldep zarith_version.ml z.ml q.ml big_int_Z.ml z.mli q.mli big_int_Z.mli > depend
- ocamlc -g -I +compiler-libs -bin-annot -c zarith_version.ml
- ocamlc -g -I +compiler-libs -bin-annot -c z.mli
- ocamlc -g -I +compiler-libs -bin-annot -c z.ml
- ocamlc -g -I +compiler-libs -bin-annot -c q.mli
- ocamlc -g -I +compiler-libs -bin-annot -c q.ml
- ocamlc -g -I +compiler-libs -bin-annot -c big_int_Z.mli
- ocamlc -g -I +compiler-libs -bin-annot -c big_int_Z.ml
- ocamlmklib -g -failsafe -o zarith zarith_version.cmo z.cmo q.cmo big_int_Z.cmo -L/usr/local/lib -lgmp -L/usr/local/lib
- ocamlc -ccopt "-I/usr/home/opam/.opam/5.1.0/lib/ocaml -I/usr/local/include -DHAS_GMP -O3 -Wall -Wextra -I/usr/local/include" -c caml_z.c
- ocamlmklib -g -failsafe -o zarith caml_z.o -L/usr/local/lib -lgmp -L/usr/local/lib
- ocamlc -g -I +compiler-libs -bin-annot -c zarith_top.ml
- ocamlc -g -o zarith_top.cma -a zarith_top.cmo
- ocamlopt -g -I +compiler-libs -c zarith_version.ml
- ocamlopt -g -I +compiler-libs -c z.ml
- ocamlopt -g -I +compiler-libs -c q.ml
- ocamlopt -g -I +compiler-libs -c big_int_Z.ml
- ocamlmklib -g -failsafe -o zarith zarith_version.cmx z.cmx q.cmx big_int_Z.cmx -L/usr/local/lib -lgmp -L/usr/local/lib
- ocamlopt -shared -o zarith.cmxs -I . zarith.cmxa -linkall
-> compiled zarith.1.13
Processing 80/204: [dune: ocaml 15]
Processing 81/204: [dune: ocaml 15] [zarith: gmake install]
- ocamlfind install -destdir "/usr/home/opam/.opam/5.1.0/lib" zarith META zarith.cma libzarith.a z.cmi q.cmi big_int_Z.cmi zarith_top.cma z.mli zarith.cmxa zarith_version.cmx z.cmx q.cmx big_int_Z.cmx zarith.cmxs zarith.h q.mli big_int_Z.mli zarith.a z.cmti q.cmti big_int_Z.cmti -optional dllzarith.so
- Installed /usr/home/opam/.opam/5.1.0/lib/zarith/big_int_Z.cmti
- Installed /usr/home/opam/.opam/5.1.0/lib/zarith/q.cmti
- Installed /usr/home/opam/.opam/5.1.0/lib/zarith/z.cmti
- Installed /usr/home/opam/.opam/5.1.0/lib/zarith/zarith.a
- Installed /usr/home/opam/.opam/5.1.0/lib/zarith/big_int_Z.mli
- Installed /usr/home/opam/.opam/5.1.0/lib/zarith/q.mli
- Installed /usr/home/opam/.opam/5.1.0/lib/zarith/zarith.h
- Installed /usr/home/opam/.opam/5.1.0/lib/zarith/zarith.cmxs
- Installed /usr/home/opam/.opam/5.1.0/lib/zarith/big_int_Z.cmx
- Installed /usr/home/opam/.opam/5.1.0/lib/zarith/q.cmx
- Installed /usr/home/opam/.opam/5.1.0/lib/zarith/z.cmx
- Installed /usr/home/opam/.opam/5.1.0/lib/zarith/zarith_version.cmx
- Installed /usr/home/opam/.opam/5.1.0/lib/zarith/zarith.cmxa
- Installed /usr/home/opam/.opam/5.1.0/lib/zarith/z.mli
- Installed /usr/home/opam/.opam/5.1.0/lib/zarith/zarith_top.cma
- Installed /usr/home/opam/.opam/5.1.0/lib/zarith/big_int_Z.cmi
- Installed /usr/home/opam/.opam/5.1.0/lib/zarith/q.cmi
- Installed /usr/home/opam/.opam/5.1.0/lib/zarith/z.cmi
- Installed /usr/home/opam/.opam/5.1.0/lib/zarith/libzarith.a
- Installed /usr/home/opam/.opam/5.1.0/lib/zarith/zarith.cma
- Installed /usr/home/opam/.opam/5.1.0/lib/stublibs/dllzarith.so
- Installed /usr/home/opam/.opam/5.1.0/lib/stublibs/dllzarith.so.owner
- ocamlfind: [WARNING] You have installed DLLs but the directory /usr/home/opam/.opam/5.1.0/lib/stublibs is not mentioned in ld.conf
- Installed /usr/home/opam/.opam/5.1.0/lib/zarith/META
-> installed zarith.1.13
Processing 81/204: [dune: ocaml 15]
+ /usr/home/opam/.opam/5.1.0/bin/ocaml "boot/bootstrap.ml" "-j" "15" (CWD=/usr/home/opam/.opam/5.1.0/.opam-switch/build/dune.3.11.1)
- ocamlc -output-complete-exe -w -24 -g -o .duneboot.exe -I boot -I +unix unix.cma boot/libs.ml boot/duneboot.ml
- ./.duneboot.exe -j 15
-
Processing 81/204: [dune: ./_boot/dune.exe build]
+ /usr/home/opam/.opam/5.1.0/.opam-switch/build/dune.3.11.1/./_boot/dune.exe "build" "dune.install" "--release" "--profile" "dune-bootstrap" "-j" "15" (CWD=/usr/home/opam/.opam/5.1.0/.opam-switch/build/dune.3.11.1)
-> compiled dune.3.11.1
-> installed dune.3.11.1
Processing 83/204: [csexp: dune build]
Processing 84/204: [csexp: dune build] [jane-street-headers: dune build]
Processing 85/204: [csexp: dune build] [jane-street-headers: dune build] [ocaml-compiler-libs: dune build]
Processing 86/204: [csexp: dune build] [jane-street-headers: dune build] [ocaml-compiler-libs: dune build] [ppx_derivers: dune build]
Processing 87/204: [csexp: dune build] [jane-street-headers: dune build] [ocaml-compiler-libs: dune build] [ppx_derivers: dune build] [re: dune build]
Processing 88/204: [csexp: dune build] [jane-street-headers: dune build] [ocaml-compiler-libs: dune build] [ppx_derivers: dune build] [re: dune build] [sexplib0: dune build]
Processing 89/204: [csexp: dune build] [jane-street-headers: dune build] [ocaml-compiler-libs: dune build] [ppx_derivers: dune build] [re: dune build] [sexplib0: dune build] [stdlib-shims: dune build]
Processing 90/204: [csexp: dune build] [jane-street-headers: dune build] [ocaml-compiler-libs: dune build] [ppx_derivers: dune build] [re: dune build] [sexplib0: dune build] [stdlib-shims: dune build] [zarith_stubs_js: dune build]
-> compiled jane-street-headers.v0.16.0
Processing 90/204: [csexp: dune build] [ocaml-compiler-libs: dune build] [ppx_derivers: dune build] [re: dune build] [sexplib0: dune build] [stdlib-shims: dune build] [zarith_stubs_js: dune build]
-> installed jane-street-headers.v0.16.0
Processing 91/204: [csexp: dune build] [ocaml-compiler-libs: dune build] [ppx_derivers: dune build] [re: dune build] [sexplib0: dune build] [stdlib-shims: dune build] [zarith_stubs_js: dune build]
-> compiled ppx_derivers.1.2.1
Processing 91/204: [csexp: dune build] [ocaml-compiler-libs: dune build] [re: dune build] [sexplib0: dune build] [stdlib-shims: dune build] [zarith_stubs_js: dune build]
-> installed ppx_derivers.1.2.1
Processing 92/204: [csexp: dune build] [ocaml-compiler-libs: dune build] [re: dune build] [sexplib0: dune build] [stdlib-shims: dune build] [zarith_stubs_js: dune build]
-> compiled zarith_stubs_js.v0.16.0
Processing 92/204: [csexp: dune build] [ocaml-compiler-libs: dune build] [re: dune build] [sexplib0: dune build] [stdlib-shims: dune build]
-> installed zarith_stubs_js.v0.16.0
Processing 93/204: [csexp: dune build] [ocaml-compiler-libs: dune build] [re: dune build] [sexplib0: dune build] [stdlib-shims: dune build]
-> compiled stdlib-shims.0.3.0
Processing 93/204: [csexp: dune build] [ocaml-compiler-libs: dune build] [re: dune build] [sexplib0: dune build]
-> installed stdlib-shims.0.3.0
Processing 94/204: [csexp: dune build] [ocaml-compiler-libs: dune build] [re: dune build] [sexplib0: dune build]
-> compiled csexp.1.5.2
Processing 94/204: [ocaml-compiler-libs: dune build] [re: dune build] [sexplib0: dune build]
-> installed csexp.1.5.2
Processing 95/204: [ocaml-compiler-libs: dune build] [re: dune build] [sexplib0: dune build]
Processing 96/204: [dune-configurator: rm] [ocaml-compiler-libs: dune build] [re: dune build] [sexplib0: dune build]
-> compiled sexplib0.v0.16.0
Processing 96/204: [dune-configurator: rm] [ocaml-compiler-libs: dune build] [re: dune build]
-> installed sexplib0.v0.16.0
Processing 97/204: [dune-configurator: rm] [ocaml-compiler-libs: dune build] [re: dune build]
Processing 98/204: [dune-configurator: rm] [ocaml-compiler-libs: dune build] [parsexp: dune build] [re: dune build]
Processing 98/204: [dune-configurator: dune build] [ocaml-compiler-libs: dune build] [parsexp: dune build] [re: dune build]
-> compiled ocaml-compiler-libs.v0.12.4
Processing 98/204: [dune-configurator: dune build] [parsexp: dune build] [re: dune build]
-> installed ocaml-compiler-libs.v0.12.4
Processing 99/204: [dune-configurator: dune build] [parsexp: dune build] [re: dune build]
Processing 100/204: [dune-configurator: dune build] [parsexp: dune build] [ppxlib: dune build] [re: dune build]
-> compiled re.1.11.0
Processing 100/204: [dune-configurator: dune build] [parsexp: dune build] [ppxlib: dune build]
-> installed re.1.11.0
Processing 101/204: [dune-configurator: dune build] [parsexp: dune build] [ppxlib: dune build]
-> compiled dune-configurator.3.11.1
Processing 101/204: [parsexp: dune build] [ppxlib: dune build]
-> installed dune-configurator.3.11.1
Processing 102/204: [parsexp: dune build] [ppxlib: dune build]
Processing 103/204: [base: dune build] [parsexp: dune build] [ppxlib: dune build]
-> compiled parsexp.v0.16.0
Processing 103/204: [base: dune build] [ppxlib: dune build]
-> installed parsexp.v0.16.0
Processing 104/204: [base: dune build] [ppxlib: dune build]
Processing 105/204: [base: dune build] [ppxlib: dune build] [sexplib: dune build]
-> compiled sexplib.v0.16.0
Processing 105/204: [base: dune build] [ppxlib: dune build]
-> installed sexplib.v0.16.0
Processing 106/204: [base: dune build] [ppxlib: dune build]
-> compiled base.v0.16.3
Processing 106/204: [ppxlib: dune build]
-> installed base.v0.16.3
Processing 107/204: [ppxlib: dune build]
Processing 108/204: [fieldslib: dune build] [ppxlib: dune build]
Processing 109/204: [fieldslib: dune build] [ppxlib: dune build] [stdio: dune build]
Processing 110/204: [fieldslib: dune build] [ppxlib: dune build] [stdio: dune build] [typerep: dune build]
Processing 111/204: [fieldslib: dune build] [ppxlib: dune build] [stdio: dune build] [typerep: dune build] [variantslib: dune build]
-> compiled variantslib.v0.16.0
Processing 111/204: [fieldslib: dune build] [ppxlib: dune build] [stdio: dune build] [typerep: dune build]
-> installed variantslib.v0.16.0
Processing 112/204: [fieldslib: dune build] [ppxlib: dune build] [stdio: dune build] [typerep: dune build]
-> compiled fieldslib.v0.16.0
Processing 112/204: [ppxlib: dune build] [stdio: dune build] [typerep: dune build]
-> installed fieldslib.v0.16.0
Processing 113/204: [ppxlib: dune build] [stdio: dune build] [typerep: dune build]
-> compiled stdio.v0.16.0
Processing 113/204: [ppxlib: dune build] [typerep: dune build]
-> installed stdio.v0.16.0
Processing 114/204: [ppxlib: dune build] [typerep: dune build]
-> compiled typerep.v0.16.0
Processing 114/204: [ppxlib: dune build]
-> installed typerep.v0.16.0
Processing 115/204: [ppxlib: dune build]
+ /usr/home/opam/.opam/5.1.0/bin/dune "build" "-p" "ppxlib" "-j" "15" "@install" (CWD=/usr/home/opam/.opam/5.1.0/.opam-switch/build/ppxlib.0.31.0)
-> compiled ppxlib.0.31.0
-> installed ppxlib.0.31.0
Processing 117/204: [ppx_cold: dune build]
Processing 118/204: [ppx_cold: dune build] [ppx_compare: dune build]
Processing 119/204: [ppx_cold: dune build] [ppx_compare: dune build] [ppx_disable_unused_warnings: dune build]
Processing 120/204: [ppx_cold: dune build] [ppx_compare: dune build] [ppx_disable_unused_warnings: dune build] [ppx_enumerate: dune build]
Processing 121/204: [ppx_cold: dune build] [ppx_compare: dune build] [ppx_disable_unused_warnings: dune build] [ppx_enumerate: dune build] [ppx_fields_conv: dune build]
Processing 122/204: [ppx_cold: dune build] [ppx_compare: dune build] [ppx_disable_unused_warnings: dune build] [ppx_enumerate: dune build] [ppx_fields_conv: dune build] [ppx_fixed_literal: dune build]
Processing 123/204: [ppx_cold: dune build] [ppx_compare: dune build] [ppx_disable_unused_warnings: dune build] [ppx_enumerate: dune build] [ppx_fields_conv: dune build] [ppx_fixed_literal: dune build] [ppx_globalize: dune build]
Processing 124/204: [ppx_cold: dune build] [ppx_compare: dune build] [ppx_disable_unused_warnings: dune build] [ppx_enumerate: dune build] [ppx_fields_conv: dune build] [ppx_fixed_literal: dune build] [ppx_globalize: dune build] [ppx_here: dune build]
Processing 125/204: [ppx_cold: dune build] [ppx_compare: dune build] [ppx_disable_unused_warnings: dune build] [ppx_enumerate: dune build] [ppx_fields_conv: dune build] [ppx_fixed_literal: dune build] [ppx_globalize: dune build] [ppx_here: dune build] [ppx_ignore_instrumentation: dune build]
Processing 126/204: [ppx_cold: dune build] [ppx_compare: dune build] [ppx_disable_unused_warnings: dune build] [ppx_enumerate: dune build] [ppx_fields_conv: dune build] [ppx_fixed_literal: dune build] [ppx_globalize: dune build] [ppx_here: dune build] [ppx_ignore_instrumentation: dune build] [ppx_optcomp: dune build]
Processing 127/204: [ppx_cold: dune build] [ppx_compare: dune build] [ppx_disable_unused_warnings: dune build] [ppx_enumerate: dune build] [ppx_fields_conv: dune build] [ppx_fixed_literal: dune build] [ppx_globalize: dune build] [ppx_here: dune build] [ppx_ignore_instrumentation: dune build] [ppx_optcomp: dune build] [ppx_optional: dune build]
Processing 128/204: [ppx_cold: dune build] [ppx_compare: dune build] [ppx_disable_unused_warnings: dune build] [ppx_enumerate: dune build] [ppx_fields_conv: dune build] [ppx_fixed_literal: dune build] [ppx_globalize: dune build] [ppx_here: dune build] [ppx_ignore_instrumentation: dune build] [ppx_optcomp: dune build] [ppx_optional: dune build] [ppx_pipebang: dune build]
Processing 129/204: [ppx_cold: dune build] [ppx_compare: dune build] [ppx_disable_unused_warnings: dune build] [ppx_enumerate: dune build] [ppx_fields_conv: dune build] [ppx_fixed_literal: dune build] [ppx_globalize: dune build] [ppx_here: dune build] [ppx_ignore_instrumentation: dune build] [ppx_optcomp: dune build] [ppx_optional: dune build] [ppx_pipebang: dune build] [ppx_sexp_conv: dune build]
Processing 130/204: [ppx_cold: dune build] [ppx_compare: dune build] [ppx_disable_unused_warnings: dune build] [ppx_enumerate: dune build] [ppx_fields_conv: dune build] [ppx_fixed_literal: dune build] [ppx_globalize: dune build] [ppx_here: dune build] [ppx_ignore_instrumentation: dune build] [ppx_optcomp: dune build] [ppx_optional: dune build] [ppx_pipebang: dune build] [ppx_sexp_conv: dune build] [ppx_stable: dune build]
Processing 131/204: [ppx_cold: dune build] [ppx_compare: dune build] [ppx_disable_unused_warnings: dune build] [ppx_enumerate: dune build] [ppx_fields_conv: dune build] [ppx_fixed_literal: dune build] [ppx_globalize: dune build] [ppx_here: dune build] [ppx_ignore_instrumentation: dune build] [ppx_optcomp: dune build] [ppx_optional: dune build] [ppx_pipebang: dune build] [ppx_sexp_conv: dune build] [ppx_stable: dune build] [ppx_stable_witness: dune build]
-> compiled ppx_globalize.v0.16.0
Processing 131/204: [ppx_cold: dune build] [ppx_compare: dune build] [ppx_disable_unused_warnings: dune build] [ppx_enumerate: dune build] [ppx_fields_conv: dune build] [ppx_fixed_literal: dune build] [ppx_here: dune build] [ppx_ignore_instrumentation: dune build] [ppx_optcomp: dune build] [ppx_optional: dune build] [ppx_pipebang: dune build] [ppx_sexp_conv: dune build] [ppx_stable: dune build] [ppx_stable_witness: dune build]
Processing 132/204: [ppx_cold: dune build] [ppx_compare: dune build] [ppx_disable_unused_warnings: dune build] [ppx_enumerate: dune build] [ppx_fields_conv: dune build] [ppx_fixed_literal: dune build] [ppx_here: dune build] [ppx_ignore_instrumentation: dune build] [ppx_optcomp: dune build] [ppx_optional: dune build] [ppx_pipebang: dune build] [ppx_sexp_conv: dune build] [ppx_stable: dune build] [ppx_stable_witness: dune build] [ppx_tydi: dune build]
-> installed ppx_globalize.v0.16.0
Processing 133/204: [ppx_cold: dune build] [ppx_compare: dune build] [ppx_disable_unused_warnings: dune build] [ppx_enumerate: dune build] [ppx_fields_conv: dune build] [ppx_fixed_literal: dune build] [ppx_here: dune build] [ppx_ignore_instrumentation: dune build] [ppx_optcomp: dune build] [ppx_optional: dune build] [ppx_pipebang: dune build] [ppx_sexp_conv: dune build] [ppx_stable: dune build] [ppx_stable_witness: dune build] [ppx_tydi: dune build]
-> compiled ppx_cold.v0.16.0
Processing 133/204: [ppx_compare: dune build] [ppx_disable_unused_warnings: dune build] [ppx_enumerate: dune build] [ppx_fields_conv: dune build] [ppx_fixed_literal: dune build] [ppx_here: dune build] [ppx_ignore_instrumentation: dune build] [ppx_optcomp: dune build] [ppx_optional: dune build] [ppx_pipebang: dune build] [ppx_sexp_conv: dune build] [ppx_stable: dune build] [ppx_stable_witness: dune build] [ppx_tydi: dune build]
Processing 134/204: [ppx_compare: dune build] [ppx_disable_unused_warnings: dune build] [ppx_enumerate: dune build] [ppx_fields_conv: dune build] [ppx_fixed_literal: dune build] [ppx_here: dune build] [ppx_ignore_instrumentation: dune build] [ppx_optcomp: dune build] [ppx_optional: dune build] [ppx_pipebang: dune build] [ppx_sexp_conv: dune build] [ppx_stable: dune build] [ppx_stable_witness: dune build] [ppx_tydi: dune build] [ppx_typerep_conv: dune build]
-> installed ppx_cold.v0.16.0
Processing 135/204: [ppx_compare: dune build] [ppx_disable_unused_warnings: dune build] [ppx_enumerate: dune build] [ppx_fields_conv: dune build] [ppx_fixed_literal: dune build] [ppx_here: dune build] [ppx_ignore_instrumentation: dune build] [ppx_optcomp: dune build] [ppx_optional: dune build] [ppx_pipebang: dune build] [ppx_sexp_conv: dune build] [ppx_stable: dune build] [ppx_stable_witness: dune build] [ppx_tydi: dune build] [ppx_typerep_conv: dune build]
-> compiled ppx_disable_unused_warnings.v0.16.0
Processing 135/204: [ppx_compare: dune build] [ppx_enumerate: dune build] [ppx_fields_conv: dune build] [ppx_fixed_literal: dune build] [ppx_here: dune build] [ppx_ignore_instrumentation: dune build] [ppx_optcomp: dune build] [ppx_optional: dune build] [ppx_pipebang: dune build] [ppx_sexp_conv: dune build] [ppx_stable: dune build] [ppx_stable_witness: dune build] [ppx_tydi: dune build] [ppx_typerep_conv: dune build]
Processing 136/204: [ppx_compare: dune build] [ppx_enumerate: dune build] [ppx_fields_conv: dune build] [ppx_fixed_literal: dune build] [ppx_here: dune build] [ppx_ignore_instrumentation: dune build] [ppx_optcomp: dune build] [ppx_optional: dune build] [ppx_pipebang: dune build] [ppx_sexp_conv: dune build] [ppx_stable: dune build] [ppx_stable_witness: dune build] [ppx_tydi: dune build] [ppx_typerep_conv: dune build] [ppx_variants_conv: dune build]
-> installed ppx_disable_unused_warnings.v0.16.0
Processing 137/204: [ppx_compare: dune build] [ppx_enumerate: dune build] [ppx_fields_conv: dune build] [ppx_fixed_literal: dune build] [ppx_here: dune build] [ppx_ignore_instrumentation: dune build] [ppx_optcomp: dune build] [ppx_optional: dune build] [ppx_pipebang: dune build] [ppx_sexp_conv: dune build] [ppx_stable: dune build] [ppx_stable_witness: dune build] [ppx_tydi: dune build] [ppx_typerep_conv: dune build] [ppx_variants_conv: dune build]
-> compiled ppx_optcomp.v0.16.0
Processing 137/204: [ppx_compare: dune build] [ppx_enumerate: dune build] [ppx_fields_conv: dune build] [ppx_fixed_literal: dune build] [ppx_here: dune build] [ppx_ignore_instrumentation: dune build] [ppx_optional: dune build] [ppx_pipebang: dune build] [ppx_sexp_conv: dune build] [ppx_stable: dune build] [ppx_stable_witness: dune build] [ppx_tydi: dune build] [ppx_typerep_conv: dune build] [ppx_variants_conv: dune build]
-> installed ppx_optcomp.v0.16.0
Processing 138/204: [ppx_compare: dune build] [ppx_enumerate: dune build] [ppx_fields_conv: dune build] [ppx_fixed_literal: dune build] [ppx_here: dune build] [ppx_ignore_instrumentation: dune build] [ppx_optional: dune build] [ppx_pipebang: dune build] [ppx_sexp_conv: dune build] [ppx_stable: dune build] [ppx_stable_witness: dune build] [ppx_tydi: dune build] [ppx_typerep_conv: dune build] [ppx_variants_conv: dune build]
-> compiled ppx_enumerate.v0.16.0
Processing 138/204: [ppx_compare: dune build] [ppx_fields_conv: dune build] [ppx_fixed_literal: dune build] [ppx_here: dune build] [ppx_ignore_instrumentation: dune build] [ppx_optional: dune build] [ppx_pipebang: dune build] [ppx_sexp_conv: dune build] [ppx_stable: dune build] [ppx_stable_witness: dune build] [ppx_tydi: dune build] [ppx_typerep_conv: dune build] [ppx_variants_conv: dune build]
-> installed ppx_enumerate.v0.16.0
Processing 139/204: [ppx_compare: dune build] [ppx_fields_conv: dune build] [ppx_fixed_literal: dune build] [ppx_here: dune build] [ppx_ignore_instrumentation: dune build] [ppx_optional: dune build] [ppx_pipebang: dune build] [ppx_sexp_conv: dune build] [ppx_stable: dune build] [ppx_stable_witness: dune build] [ppx_tydi: dune build] [ppx_typerep_conv: dune build] [ppx_variants_conv: dune build]
-> compiled ppx_here.v0.16.0
Processing 139/204: [ppx_compare: dune build] [ppx_fields_conv: dune build] [ppx_fixed_literal: dune build] [ppx_ignore_instrumentation: dune build] [ppx_optional: dune build] [ppx_pipebang: dune build] [ppx_sexp_conv: dune build] [ppx_stable: dune build] [ppx_stable_witness: dune build] [ppx_tydi: dune build] [ppx_typerep_conv: dune build] [ppx_variants_conv: dune build]
-> installed ppx_here.v0.16.0
Processing 140/204: [ppx_compare: dune build] [ppx_fields_conv: dune build] [ppx_fixed_literal: dune build] [ppx_ignore_instrumentation: dune build] [ppx_optional: dune build] [ppx_pipebang: dune build] [ppx_sexp_conv: dune build] [ppx_stable: dune build] [ppx_stable_witness: dune build] [ppx_tydi: dune build] [ppx_typerep_conv: dune build] [ppx_variants_conv: dune build]
Processing 141/204: [ppx_compare: dune build] [ppx_fields_conv: dune build] [ppx_fixed_literal: dune build] [ppx_ignore_instrumentation: dune build] [ppx_let: dune build] [ppx_optional: dune build] [ppx_pipebang: dune build] [ppx_sexp_conv: dune build] [ppx_stable: dune build] [ppx_stable_witness: dune build] [ppx_tydi: dune build] [ppx_typerep_conv: dune build] [ppx_variants_conv: dune build]
-> compiled ppx_stable.v0.16.0
Processing 141/204: [ppx_compare: dune build] [ppx_fields_conv: dune build] [ppx_fixed_literal: dune build] [ppx_ignore_instrumentation: dune build] [ppx_let: dune build] [ppx_optional: dune build] [ppx_pipebang: dune build] [ppx_sexp_conv: dune build] [ppx_stable_witness: dune build] [ppx_tydi: dune build] [ppx_typerep_conv: dune build] [ppx_variants_conv: dune build]
-> installed ppx_stable.v0.16.0
Processing 142/204: [ppx_compare: dune build] [ppx_fields_conv: dune build] [ppx_fixed_literal: dune build] [ppx_ignore_instrumentation: dune build] [ppx_let: dune build] [ppx_optional: dune build] [ppx_pipebang: dune build] [ppx_sexp_conv: dune build] [ppx_stable_witness: dune build] [ppx_tydi: dune build] [ppx_typerep_conv: dune build] [ppx_variants_conv: dune build]
-> compiled ppx_fields_conv.v0.16.0
Processing 142/204: [ppx_compare: dune build] [ppx_fixed_literal: dune build] [ppx_ignore_instrumentation: dune build] [ppx_let: dune build] [ppx_optional: dune build] [ppx_pipebang: dune build] [ppx_sexp_conv: dune build] [ppx_stable_witness: dune build] [ppx_tydi: dune build] [ppx_typerep_conv: dune build] [ppx_variants_conv: dune build]
-> installed ppx_fields_conv.v0.16.0
Processing 143/204: [ppx_compare: dune build] [ppx_fixed_literal: dune build] [ppx_ignore_instrumentation: dune build] [ppx_let: dune build] [ppx_optional: dune build] [ppx_pipebang: dune build] [ppx_sexp_conv: dune build] [ppx_stable_witness: dune build] [ppx_tydi: dune build] [ppx_typerep_conv: dune build] [ppx_variants_conv: dune build]
-> compiled ppx_compare.v0.16.0
Processing 143/204: [ppx_fixed_literal: dune build] [ppx_ignore_instrumentation: dune build] [ppx_let: dune build] [ppx_optional: dune build] [ppx_pipebang: dune build] [ppx_sexp_conv: dune build] [ppx_stable_witness: dune build] [ppx_tydi: dune build] [ppx_typerep_conv: dune build] [ppx_variants_conv: dune build]
-> installed ppx_compare.v0.16.0
Processing 144/204: [ppx_fixed_literal: dune build] [ppx_ignore_instrumentation: dune build] [ppx_let: dune build] [ppx_optional: dune build] [ppx_pipebang: dune build] [ppx_sexp_conv: dune build] [ppx_stable_witness: dune build] [ppx_tydi: dune build] [ppx_typerep_conv: dune build] [ppx_variants_conv: dune build]
-> compiled ppx_ignore_instrumentation.v0.16.0
Processing 144/204: [ppx_fixed_literal: dune build] [ppx_let: dune build] [ppx_optional: dune build] [ppx_pipebang: dune build] [ppx_sexp_conv: dune build] [ppx_stable_witness: dune build] [ppx_tydi: dune build] [ppx_typerep_conv: dune build] [ppx_variants_conv: dune build]
-> installed ppx_ignore_instrumentation.v0.16.0
Processing 145/204: [ppx_fixed_literal: dune build] [ppx_let: dune build] [ppx_optional: dune build] [ppx_pipebang: dune build] [ppx_sexp_conv: dune build] [ppx_stable_witness: dune build] [ppx_tydi: dune build] [ppx_typerep_conv: dune build] [ppx_variants_conv: dune build]
-> compiled ppx_tydi.v0.16.0
Processing 145/204: [ppx_fixed_literal: dune build] [ppx_let: dune build] [ppx_optional: dune build] [ppx_pipebang: dune build] [ppx_sexp_conv: dune build] [ppx_stable_witness: dune build] [ppx_typerep_conv: dune build] [ppx_variants_conv: dune build]
-> installed ppx_tydi.v0.16.0
Processing 146/204: [ppx_fixed_literal: dune build] [ppx_let: dune build] [ppx_optional: dune build] [ppx_pipebang: dune build] [ppx_sexp_conv: dune build] [ppx_stable_witness: dune build] [ppx_typerep_conv: dune build] [ppx_variants_conv: dune build]
-> compiled ppx_stable_witness.v0.16.0
Processing 146/204: [ppx_fixed_literal: dune build] [ppx_let: dune build] [ppx_optional: dune build] [ppx_pipebang: dune build] [ppx_sexp_conv: dune build] [ppx_typerep_conv: dune build] [ppx_variants_conv: dune build]
-> installed ppx_stable_witness.v0.16.0
Processing 147/204: [ppx_fixed_literal: dune build] [ppx_let: dune build] [ppx_optional: dune build] [ppx_pipebang: dune build] [ppx_sexp_conv: dune build] [ppx_typerep_conv: dune build] [ppx_variants_conv: dune build]
-> compiled ppx_pipebang.v0.16.0
Processing 147/204: [ppx_fixed_literal: dune build] [ppx_let: dune build] [ppx_optional: dune build] [ppx_sexp_conv: dune build] [ppx_typerep_conv: dune build] [ppx_variants_conv: dune build]
-> installed ppx_pipebang.v0.16.0
Processing 148/204: [ppx_fixed_literal: dune build] [ppx_let: dune build] [ppx_optional: dune build] [ppx_sexp_conv: dune build] [ppx_typerep_conv: dune build] [ppx_variants_conv: dune build]
-> compiled ppx_optional.v0.16.0
Processing 148/204: [ppx_fixed_literal: dune build] [ppx_let: dune build] [ppx_sexp_conv: dune build] [ppx_typerep_conv: dune build] [ppx_variants_conv: dune build]
-> installed ppx_optional.v0.16.0
Processing 149/204: [ppx_fixed_literal: dune build] [ppx_let: dune build] [ppx_sexp_conv: dune build] [ppx_typerep_conv: dune build] [ppx_variants_conv: dune build]
-> compiled ppx_fixed_literal.v0.16.0
Processing 149/204: [ppx_let: dune build] [ppx_sexp_conv: dune build] [ppx_typerep_conv: dune build] [ppx_variants_conv: dune build]
-> installed ppx_fixed_literal.v0.16.0
Processing 150/204: [ppx_let: dune build] [ppx_sexp_conv: dune build] [ppx_typerep_conv: dune build] [ppx_variants_conv: dune build]
-> compiled ppx_sexp_conv.v0.16.0
Processing 150/204: [ppx_let: dune build] [ppx_typerep_conv: dune build] [ppx_variants_conv: dune build]
-> installed ppx_sexp_conv.v0.16.0
Processing 151/204: [ppx_let: dune build] [ppx_typerep_conv: dune build] [ppx_variants_conv: dune build]
Processing 152/204: [ppx_assert: dune build] [ppx_let: dune build] [ppx_typerep_conv: dune build] [ppx_variants_conv: dune build]
Processing 153/204: [ppx_assert: dune build] [ppx_custom_printf: dune build] [ppx_let: dune build] [ppx_typerep_conv: dune build] [ppx_variants_conv: dune build]
Processing 154/204: [ppx_assert: dune build] [ppx_custom_printf: dune build] [ppx_hash: dune build] [ppx_let: dune build] [ppx_typerep_conv: dune build] [ppx_variants_conv: dune build]
Processing 155/204: [ppx_assert: dune build] [ppx_custom_printf: dune build] [ppx_hash: dune build] [ppx_let: dune build] [ppx_sexp_message: dune build] [ppx_typerep_conv: dune build] [ppx_variants_conv: dune build]
Processing 156/204: [ppx_assert: dune build] [ppx_custom_printf: dune build] [ppx_hash: dune build] [ppx_let: dune build] [ppx_sexp_message: dune build] [ppx_sexp_value: dune build] [ppx_typerep_conv: dune build] [ppx_variants_conv: dune build]
-> compiled ppx_typerep_conv.v0.16.0
Processing 156/204: [ppx_assert: dune build] [ppx_custom_printf: dune build] [ppx_hash: dune build] [ppx_let: dune build] [ppx_sexp_message: dune build] [ppx_sexp_value: dune build] [ppx_variants_conv: dune build]
-> installed ppx_typerep_conv.v0.16.0
Processing 157/204: [ppx_assert: dune build] [ppx_custom_printf: dune build] [ppx_hash: dune build] [ppx_let: dune build] [ppx_sexp_message: dune build] [ppx_sexp_value: dune build] [ppx_variants_conv: dune build]
-> compiled ppx_variants_conv.v0.16.0
Processing 157/204: [ppx_assert: dune build] [ppx_custom_printf: dune build] [ppx_hash: dune build] [ppx_let: dune build] [ppx_sexp_message: dune build] [ppx_sexp_value: dune build]
-> installed ppx_variants_conv.v0.16.0
Processing 158/204: [ppx_assert: dune build] [ppx_custom_printf: dune build] [ppx_hash: dune build] [ppx_let: dune build] [ppx_sexp_message: dune build] [ppx_sexp_value: dune build]
-> compiled ppx_let.v0.16.0
Processing 158/204: [ppx_assert: dune build] [ppx_custom_printf: dune build] [ppx_hash: dune build] [ppx_sexp_message: dune build] [ppx_sexp_value: dune build]
-> installed ppx_let.v0.16.0
Processing 159/204: [ppx_assert: dune build] [ppx_custom_printf: dune build] [ppx_hash: dune build] [ppx_sexp_message: dune build] [ppx_sexp_value: dune build]
-> compiled ppx_sexp_value.v0.16.0
Processing 159/204: [ppx_assert: dune build] [ppx_custom_printf: dune build] [ppx_hash: dune build] [ppx_sexp_message: dune build]
-> installed ppx_sexp_value.v0.16.0
Processing 160/204: [ppx_assert: dune build] [ppx_custom_printf: dune build] [ppx_hash: dune build] [ppx_sexp_message: dune build]
-> compiled ppx_assert.v0.16.0
Processing 160/204: [ppx_custom_printf: dune build] [ppx_hash: dune build] [ppx_sexp_message: dune build]
-> installed ppx_assert.v0.16.0
Processing 161/204: [ppx_custom_printf: dune build] [ppx_hash: dune build] [ppx_sexp_message: dune build]
Processing 162/204: [jst-config: dune build] [ppx_custom_printf: dune build] [ppx_hash: dune build] [ppx_sexp_message: dune build]
-> compiled ppx_sexp_message.v0.16.0
Processing 162/204: [jst-config: dune build] [ppx_custom_printf: dune build] [ppx_hash: dune build]
-> installed ppx_sexp_message.v0.16.0
Processing 163/204: [jst-config: dune build] [ppx_custom_printf: dune build] [ppx_hash: dune build]
Processing 164/204: [jst-config: dune build] [ppx_custom_printf: dune build] [ppx_hash: dune build] [ppx_log: dune build]
-> compiled ppx_hash.v0.16.0
Processing 164/204: [jst-config: dune build] [ppx_custom_printf: dune build] [ppx_log: dune build]
-> installed ppx_hash.v0.16.0
Processing 165/204: [jst-config: dune build] [ppx_custom_printf: dune build] [ppx_log: dune build]
Processing 166/204: [jst-config: dune build] [ppx_base: dune build] [ppx_custom_printf: dune build] [ppx_log: dune build]
-> compiled ppx_custom_printf.v0.16.0
Processing 166/204: [jst-config: dune build] [ppx_base: dune build] [ppx_log: dune build]
-> installed ppx_custom_printf.v0.16.0
Processing 167/204: [jst-config: dune build] [ppx_base: dune build] [ppx_log: dune build]
Processing 168/204: [bin_prot: dune build] [jst-config: dune build] [ppx_base: dune build] [ppx_log: dune build]
-> compiled ppx_base.v0.16.0
Processing 168/204: [bin_prot: dune build] [jst-config: dune build] [ppx_log: dune build]
-> installed ppx_base.v0.16.0
Processing 169/204: [bin_prot: dune build] [jst-config: dune build] [ppx_log: dune build]
Processing 170/204: [bin_prot: dune build] [jst-config: dune build] [ppx_log: dune build] [ppx_string: dune build]
-> compiled ppx_log.v0.16.0
Processing 170/204: [bin_prot: dune build] [jst-config: dune build] [ppx_string: dune build]
-> installed ppx_log.v0.16.0
Processing 171/204: [bin_prot: dune build] [jst-config: dune build] [ppx_string: dune build]
-> compiled jst-config.v0.16.0
Processing 171/204: [bin_prot: dune build] [ppx_string: dune build]
-> installed jst-config.v0.16.0
Processing 172/204: [bin_prot: dune build] [ppx_string: dune build]
Processing 173/204: [bin_prot: dune build] [ppx_string: dune build] [time_now: dune build]
-> compiled ppx_string.v0.16.0
Processing 173/204: [bin_prot: dune build] [time_now: dune build]
-> installed ppx_string.v0.16.0
Processing 174/204: [bin_prot: dune build] [time_now: dune build]
-> compiled bin_prot.v0.16.0
Processing 174/204: [time_now: dune build]
-> installed bin_prot.v0.16.0
Processing 175/204: [time_now: dune build]
Processing 176/204: [ppx_bin_prot: dune build] [time_now: dune build]
-> compiled time_now.v0.16.0
Processing 176/204: [ppx_bin_prot: dune build]
-> installed time_now.v0.16.0
Processing 177/204: [ppx_bin_prot: dune build]
Processing 178/204: [ppx_bin_prot: dune build] [ppx_inline_test: dune build]
Processing 179/204: [ppx_bin_prot: dune build] [ppx_inline_test: dune build] [ppx_module_timer: dune build]
-> compiled ppx_bin_prot.v0.16.0
Processing 179/204: [ppx_inline_test: dune build] [ppx_module_timer: dune build]
-> installed ppx_bin_prot.v0.16.0
Processing 180/204: [ppx_inline_test: dune build] [ppx_module_timer: dune build]
-> compiled ppx_module_timer.v0.16.0
Processing 180/204: [ppx_inline_test: dune build]
-> installed ppx_module_timer.v0.16.0
Processing 181/204: [ppx_inline_test: dune build]
+ /usr/home/opam/.opam/5.1.0/bin/dune "build" "-p" "ppx_inline_test" "-j" "15" (CWD=/usr/home/opam/.opam/5.1.0/.opam-switch/build/ppx_inline_test.v0.16.1)
-> compiled ppx_inline_test.v0.16.1
-> installed ppx_inline_test.v0.16.1
Processing 183/204: [ppx_bench: dune build]
Processing 184/204: [ppx_bench: dune build] [ppx_expect: dune build]
-> compiled ppx_bench.v0.16.0
Processing 184/204: [ppx_expect: dune build]
-> installed ppx_bench.v0.16.0
Processing 185/204: [ppx_expect: dune build]
Processing 186/204: [ppx_expect: dune build] [splittable_random: dune build]
-> compiled splittable_random.v0.16.0
Processing 186/204: [ppx_expect: dune build]
-> installed splittable_random.v0.16.0
Processing 187/204: [ppx_expect: dune build]
Processing 188/204: [base_quickcheck: dune build] [ppx_expect: dune build]
-> compiled ppx_expect.v0.16.0
Processing 188/204: [base_quickcheck: dune build]
-> installed ppx_expect.v0.16.0
Processing 189/204: [base_quickcheck: dune build]
+ /usr/home/opam/.opam/5.1.0/bin/dune "build" "-p" "base_quickcheck" "-j" "15" (CWD=/usr/home/opam/.opam/5.1.0/.opam-switch/build/base_quickcheck.v0.16.0)
-> compiled base_quickcheck.v0.16.0
-> installed base_quickcheck.v0.16.0
Processing 191/204: [ppx_jane: dune build]
+ /usr/home/opam/.opam/5.1.0/bin/dune "build" "-p" "ppx_jane" "-j" "15" (CWD=/usr/home/opam/.opam/5.1.0/.opam-switch/build/ppx_jane.v0.16.0)
-> compiled ppx_jane.v0.16.0
-> installed ppx_jane.v0.16.0
Processing 193/204: [int_repr: dune build]
+ /usr/home/opam/.opam/5.1.0/bin/dune "build" "-p" "int_repr" "-j" "15" (CWD=/usr/home/opam/.opam/5.1.0/.opam-switch/build/int_repr.v0.16.0)
-> compiled int_repr.v0.16.0
-> installed int_repr.v0.16.0
Processing 195/204: [base_bigstring: dune build]
+ /usr/home/opam/.opam/5.1.0/bin/dune "build" "-p" "base_bigstring" "-j" "15" (CWD=/usr/home/opam/.opam/5.1.0/.opam-switch/build/base_bigstring.v0.16.0)
-> compiled base_bigstring.v0.16.0
-> installed base_bigstring.v0.16.0
Processing 197/204: [core: dune build]
+ /usr/home/opam/.opam/5.1.0/bin/dune "build" "-p" "core" "-j" "15" (CWD=/usr/home/opam/.opam/5.1.0/.opam-switch/build/core.v0.16.2)
- (cd _build/default/core/src && /usr/bin/cc -O2 -fno-strict-aliasing -fwrapv -pthread -fPIC -D_FILE_OFFSET_BITS=64 -O2 -fno-strict-aliasing -fwrapv -pthread -fPIC -D_LARGEFILE64_SOURCE -g -I /usr/home/opam/.opam/5.1.0/lib/ocaml -I /usr/home/opam/.opam/5.1.0/lib/base -I /usr/home/opam/.opam/5.1.0/lib/base/base_internalhash_types -I /usr/home/opam/.opam/5.1.0/lib/base/caml -I /usr/home/opam/.opam/5.1.0/lib/base/md5 -I /usr/home/opam/.opam/5.1.0/lib/base/shadow_stdlib -I /usr/home/opam/.opam/5.1.0/lib/base_bigstring -I /usr/home/opam/.opam/5.1.0/lib/base_quickcheck -I /usr/home/opam/.opam/5.1.0/lib/base_quickcheck/ppx_quickcheck/runtime -I /usr/home/opam/.opam/5.1.0/lib/bin_prot -I /usr/home/opam/.opam/5.1.0/lib/bin_prot/shape -I /usr/home/opam/.opam/5.1.0/lib/fieldslib -I /usr/home/opam/.opam/5.1.0/lib/int_repr -I /usr/home/opam/.opam/5.1.0/lib/jane-street-headers -I /usr/home/opam/.opam/5.1.0/lib/parsexp -I /usr/home/opam/.opam/5.1.0/lib/ppx_assert/runtime-lib -I /usr/home/opam/.opam/5.1.0/lib/ppx_bench/runtime-lib -I /usr/home/opam/.opam/5.1.0/lib/ppx_compare/runtime-lib -I /usr/home/opam/.opam/5.1.0/lib/ppx_enumerate/runtime-lib -I /usr/home/opam/.opam/5.1.0/lib/ppx_expect/collector -I /usr/home/opam/.opam/5.1.0/lib/ppx_expect/common -I /usr/home/opam/.opam/5.1.0/lib/ppx_expect/config -I /usr/home/opam/.opam/5.1.0/lib/ppx_expect/config_types -I /usr/home/opam/.opam/5.1.0/lib/ppx_hash/runtime-lib -I /usr/home/opam/.opam/5.1.0/lib/ppx_here/runtime-lib -I /usr/home/opam/.opam/5.1.0/lib/ppx_inline_test/config -I /usr/home/opam/.opam/5.1.0/lib/ppx_inline_test/runtime-lib -I /usr/home/opam/.opam/5.1.0/lib/ppx_log/types -I /usr/home/opam/.opam/5.1.0/lib/ppx_module_timer/runtime -I /usr/home/opam/.opam/5.1.0/lib/ppx_sexp_conv/runtime-lib -I /usr/home/opam/.opam/5.1.0/lib/ppx_stable_witness/runtime -I /usr/home/opam/.opam/5.1.0/lib/ppx_stable_witness/stable_witness -I /usr/home/opam/.opam/5.1.0/lib/sexplib -I /usr/home/opam/.opam/5.1.0/lib/sexplib0 -I /usr/home/opam/.opam/5.1.0/lib/splittable_random -I /usr/home/opam/.opam/5.1.0/lib/stdio -I /usr/home/opam/.opam/5.1.0/lib/time_now -I /usr/home/opam/.opam/5.1.0/lib/typerep -I /usr/home/opam/.opam/5.1.0/lib/variantslib -I ../../base_for_tests/src -I ../../command/src -I ../../filename_base/src -I ../../heap_block -I ../../univ_map/src -I ../../validate/src -o md5_stubs.o -c md5_stubs.c)
- md5_stubs.c:15:32: warning: pragma diagnostic expected option name (e.g. "-Wundef") [-Wunknown-pragmas]
- #pragma GCC diagnostic ignored "-pedantic"
- ^
- 1 warning generated.
- (cd _build/default/core/src && /usr/bin/cc -O2 -fno-strict-aliasing -fwrapv -pthread -fPIC -D_FILE_OFFSET_BITS=64 -O2 -fno-strict-aliasing -fwrapv -pthread -fPIC -D_LARGEFILE64_SOURCE -g -I /usr/home/opam/.opam/5.1.0/lib/ocaml -I /usr/home/opam/.opam/5.1.0/lib/base -I /usr/home/opam/.opam/5.1.0/lib/base/base_internalhash_types -I /usr/home/opam/.opam/5.1.0/lib/base/caml -I /usr/home/opam/.opam/5.1.0/lib/base/md5 -I /usr/home/opam/.opam/5.1.0/lib/base/shadow_stdlib -I /usr/home/opam/.opam/5.1.0/lib/base_bigstring -I /usr/home/opam/.opam/5.1.0/lib/base_quickcheck -I /usr/home/opam/.opam/5.1.0/lib/base_quickcheck/ppx_quickcheck/runtime -I /usr/home/opam/.opam/5.1.0/lib/bin_prot -I /usr/home/opam/.opam/5.1.0/lib/bin_prot/shape -I /usr/home/opam/.opam/5.1.0/lib/fieldslib -I /usr/home/opam/.opam/5.1.0/lib/int_repr -I /usr/home/opam/.opam/5.1.0/lib/jane-street-headers -I /usr/home/opam/.opam/5.1.0/lib/parsexp -I /usr/home/opam/.opam/5.1.0/lib/ppx_assert/runtime-lib -I /usr/home/opam/.opam/5.1.0/lib/ppx_bench/runtime-lib -I /usr/home/opam/.opam/5.1.0/lib/ppx_compare/runtime-lib -I /usr/home/opam/.opam/5.1.0/lib/ppx_enumerate/runtime-lib -I /usr/home/opam/.opam/5.1.0/lib/ppx_expect/collector -I /usr/home/opam/.opam/5.1.0/lib/ppx_expect/common -I /usr/home/opam/.opam/5.1.0/lib/ppx_expect/config -I /usr/home/opam/.opam/5.1.0/lib/ppx_expect/config_types -I /usr/home/opam/.opam/5.1.0/lib/ppx_hash/runtime-lib -I /usr/home/opam/.opam/5.1.0/lib/ppx_here/runtime-lib -I /usr/home/opam/.opam/5.1.0/lib/ppx_inline_test/config -I /usr/home/opam/.opam/5.1.0/lib/ppx_inline_test/runtime-lib -I /usr/home/opam/.opam/5.1.0/lib/ppx_log/types -I /usr/home/opam/.opam/5.1.0/lib/ppx_module_timer/runtime -I /usr/home/opam/.opam/5.1.0/lib/ppx_sexp_conv/runtime-lib -I /usr/home/opam/.opam/5.1.0/lib/ppx_stable_witness/runtime -I /usr/home/opam/.opam/5.1.0/lib/ppx_stable_witness/stable_witness -I /usr/home/opam/.opam/5.1.0/lib/sexplib -I /usr/home/opam/.opam/5.1.0/lib/sexplib0 -I /usr/home/opam/.opam/5.1.0/lib/splittable_random -I /usr/home/opam/.opam/5.1.0/lib/stdio -I /usr/home/opam/.opam/5.1.0/lib/time_now -I /usr/home/opam/.opam/5.1.0/lib/typerep -I /usr/home/opam/.opam/5.1.0/lib/variantslib -I ../../base_for_tests/src -I ../../command/src -I ../../filename_base/src -I ../../heap_block -I ../../univ_map/src -I ../../validate/src -o gc_stubs.o -c gc_stubs.c)
- gc_stubs.c:14:10: warning: '__unused' macro redefined [-Wmacro-redefined]
- # define __unused(x) x __attribute__((unused))
- ^
- /usr/include/sys/cdefs.h:217:9: note: previous definition is here
- #define __unused __attribute__((__unused__))
- ^
- 1 warning generated.
-> compiled core.v0.16.2
-> installed core.v0.16.2
Processing 199/204: [bignum: dune build]
Processing 200/204: [bignum: dune build] [core_kernel: dune build]
- (cd _build/default && /usr/home/opam/.opam/5.1.0/bin/ocamlc.opt -w -40 -g -bin-annot -I bigint/src/.bigint.objs/byte -I /usr/home/opam/.opam/5.1.0/lib/base -I /usr/home/opam/.opam/5.1.0/lib/base/base_internalhash_types -I /usr/home/opam/.opam/5.1.0/lib/base/caml -I /usr/home/opam/.opam/5.1.0/lib/base/md5 -I /usr/home/opam/.opam/5.1.0/lib/base/shadow_stdlib -I /usr/home/opam/.opam/5.1.0/lib/base_bigstring -I /usr/home/opam/.opam/5.1.0/lib/base_quickcheck -I /usr/home/opam/.opam/5.1.0/lib/base_quickcheck/ppx_quickcheck/runtime -I /usr/home/opam/.opam/5.1.0/lib/bin_prot -I /usr/home/opam/.opam/5.1.0/lib/bin_prot/shape -I /usr/home/opam/.opam/5.1.0/lib/core -I /usr/home/opam/.opam/5.1.0/lib/core/base_for_tests -I /usr/home/opam/.opam/5.1.0/lib/core/command -I /usr/home/opam/.opam/5.1.0/lib/core/filename_base -I /usr/home/opam/.opam/5.1.0/lib/core/heap_block -I /usr/home/opam/.opam/5.1.0/lib/core/univ_map -I /usr/home/opam/.opam/5.1.0/lib/core/validate -I /usr/home/opam/.opam/5.1.0/lib/fieldslib -I /usr/home/opam/.opam/5.1.0/lib/int_repr -I /usr/home/opam/.opam/5.1.0/lib/jane-street-headers -I /usr/home/opam/.opam/5.1.0/lib/num -I /usr/home/opam/.opam/5.1.0/lib/parsexp -I /usr/home/opam/.opam/5.1.0/lib/ppx_assert/runtime-lib -I /usr/home/opam/.opam/5.1.0/lib/ppx_bench/runtime-lib -I /usr/home/opam/.opam/5.1.0/lib/ppx_compare/runtime-lib -I /usr/home/opam/.opam/5.1.0/lib/ppx_enumerate/runtime-lib -I /usr/home/opam/.opam/5.1.0/lib/ppx_expect/collector -I /usr/home/opam/.opam/5.1.0/lib/ppx_expect/common -I /usr/home/opam/.opam/5.1.0/lib/ppx_expect/config -I /usr/home/opam/.opam/5.1.0/lib/ppx_expect/config_types -I /usr/home/opam/.opam/5.1.0/lib/ppx_hash/runtime-lib -I /usr/home/opam/.opam/5.1.0/lib/ppx_here/runtime-lib -I /usr/home/opam/.opam/5.1.0/lib/ppx_inline_test/config -I /usr/home/opam/.opam/5.1.0/lib/ppx_inline_test/runtime-lib -I /usr/home/opam/.opam/5.1.0/lib/ppx_log/types -I /usr/home/opam/.opam/5.1.0/lib/ppx_module_timer/runtime -I /usr/home/opam/.opam/5.1.0/lib/ppx_sexp_conv/runtime-lib -I /usr/home/opam/.opam/5.1.0/lib/ppx_stable_witness/runtime -I /usr/home/opam/.opam/5.1.0/lib/ppx_stable_witness/stable_witness -I /usr/home/opam/.opam/5.1.0/lib/sexplib -I /usr/home/opam/.opam/5.1.0/lib/sexplib0 -I /usr/home/opam/.opam/5.1.0/lib/splittable_random -I /usr/home/opam/.opam/5.1.0/lib/stdio -I /usr/home/opam/.opam/5.1.0/lib/time_now -I /usr/home/opam/.opam/5.1.0/lib/typerep -I /usr/home/opam/.opam/5.1.0/lib/variantslib -I /usr/home/opam/.opam/5.1.0/lib/zarith -I /usr/home/opam/.opam/5.1.0/lib/zarith_stubs_js -no-alias-deps -open Bigint__ -o bigint/src/.bigint.objs/byte/bigint__Zarith.cmo -c -impl bigint/src/zarith.pp.ml)
- File "bigint/src/zarith.ml", line 4, characters 24-38:
- 4 | module Zarith_version = Zarith_version
- ^^^^^^^^^^^^^^
- Warning 49 [no-cmi-file]: no cmi file was found in path for module Zarith_version
- (cd _build/default && /usr/home/opam/.opam/5.1.0/bin/ocamlopt.opt -w -40 -g -I bigint/src/.bigint.objs/byte -I bigint/src/.bigint.objs/native -I /usr/home/opam/.opam/5.1.0/lib/base -I /usr/home/opam/.opam/5.1.0/lib/base/base_internalhash_types -I /usr/home/opam/.opam/5.1.0/lib/base/caml -I /usr/home/opam/.opam/5.1.0/lib/base/md5 -I /usr/home/opam/.opam/5.1.0/lib/base/shadow_stdlib -I /usr/home/opam/.opam/5.1.0/lib/base_bigstring -I /usr/home/opam/.opam/5.1.0/lib/base_quickcheck -I /usr/home/opam/.opam/5.1.0/lib/base_quickcheck/ppx_quickcheck/runtime -I /usr/home/opam/.opam/5.1.0/lib/bin_prot -I /usr/home/opam/.opam/5.1.0/lib/bin_prot/shape -I /usr/home/opam/.opam/5.1.0/lib/core -I /usr/home/opam/.opam/5.1.0/lib/core/base_for_tests -I /usr/home/opam/.opam/5.1.0/lib/core/command -I /usr/home/opam/.opam/5.1.0/lib/core/filename_base -I /usr/home/opam/.opam/5.1.0/lib/core/heap_block -I /usr/home/opam/.opam/5.1.0/lib/core/univ_map -I /usr/home/opam/.opam/5.1.0/lib/core/validate -I /usr/home/opam/.opam/5.1.0/lib/fieldslib -I /usr/home/opam/.opam/5.1.0/lib/int_repr -I /usr/home/opam/.opam/5.1.0/lib/jane-street-headers -I /usr/home/opam/.opam/5.1.0/lib/num -I /usr/home/opam/.opam/5.1.0/lib/parsexp -I /usr/home/opam/.opam/5.1.0/lib/ppx_assert/runtime-lib -I /usr/home/opam/.opam/5.1.0/lib/ppx_bench/runtime-lib -I /usr/home/opam/.opam/5.1.0/lib/ppx_compare/runtime-lib -I /usr/home/opam/.opam/5.1.0/lib/ppx_enumerate/runtime-lib -I /usr/home/opam/.opam/5.1.0/lib/ppx_expect/collector -I /usr/home/opam/.opam/5.1.0/lib/ppx_expect/common -I /usr/home/opam/.opam/5.1.0/lib/ppx_expect/config -I /usr/home/opam/.opam/5.1.0/lib/ppx_expect/config_types -I /usr/home/opam/.opam/5.1.0/lib/ppx_hash/runtime-lib -I /usr/home/opam/.opam/5.1.0/lib/ppx_here/runtime-lib -I /usr/home/opam/.opam/5.1.0/lib/ppx_inline_test/config -I /usr/home/opam/.opam/5.1.0/lib/ppx_inline_test/runtime-lib -I /usr/home/opam/.opam/5.1.0/lib/ppx_log/types -I /usr/home/opam/.opam/5.1.0/lib/ppx_module_timer/runtime -I /usr/home/opam/.opam/5.1.0/lib/ppx_sexp_conv/runtime-lib -I /usr/home/opam/.opam/5.1.0/lib/ppx_stable_witness/runtime -I /usr/home/opam/.opam/5.1.0/lib/ppx_stable_witness/stable_witness -I /usr/home/opam/.opam/5.1.0/lib/sexplib -I /usr/home/opam/.opam/5.1.0/lib/sexplib0 -I /usr/home/opam/.opam/5.1.0/lib/splittable_random -I /usr/home/opam/.opam/5.1.0/lib/stdio -I /usr/home/opam/.opam/5.1.0/lib/time_now -I /usr/home/opam/.opam/5.1.0/lib/typerep -I /usr/home/opam/.opam/5.1.0/lib/variantslib -I /usr/home/opam/.opam/5.1.0/lib/zarith -I /usr/home/opam/.opam/5.1.0/lib/zarith_stubs_js -intf-suffix .ml -no-alias-deps -open Bigint__ -o bigint/src/.bigint.objs/native/bigint__Zarith.cmx -c -impl bigint/src/zarith.pp.ml)
- File "bigint/src/zarith.ml", line 4, characters 24-38:
- 4 | module Zarith_version = Zarith_version
- ^^^^^^^^^^^^^^
- Warning 49 [no-cmi-file]: no cmi file was found in path for module Zarith_version
- (cd _build/default && /usr/home/opam/.opam/5.1.0/bin/ocamlc.opt -w -40 -g -bin-annot -I src/.bignum.objs/byte -I /usr/home/opam/.opam/5.1.0/lib/base -I /usr/home/opam/.opam/5.1.0/lib/base/base_internalhash_types -I /usr/home/opam/.opam/5.1.0/lib/base/caml -I /usr/home/opam/.opam/5.1.0/lib/base/md5 -I /usr/home/opam/.opam/5.1.0/lib/base/shadow_stdlib -I /usr/home/opam/.opam/5.1.0/lib/base_bigstring -I /usr/home/opam/.opam/5.1.0/lib/base_quickcheck -I /usr/home/opam/.opam/5.1.0/lib/base_quickcheck/ppx_quickcheck/runtime -I /usr/home/opam/.opam/5.1.0/lib/bin_prot -I /usr/home/opam/.opam/5.1.0/lib/bin_prot/shape -I /usr/home/opam/.opam/5.1.0/lib/core -I /usr/home/opam/.opam/5.1.0/lib/core/base_for_tests -I /usr/home/opam/.opam/5.1.0/lib/core/command -I /usr/home/opam/.opam/5.1.0/lib/core/filename_base -I /usr/home/opam/.opam/5.1.0/lib/core/heap_block -I /usr/home/opam/.opam/5.1.0/lib/core/univ_map -I /usr/home/opam/.opam/5.1.0/lib/core/validate -I /usr/home/opam/.opam/5.1.0/lib/fieldslib -I /usr/home/opam/.opam/5.1.0/lib/int_repr -I /usr/home/opam/.opam/5.1.0/lib/jane-street-headers -I /usr/home/opam/.opam/5.1.0/lib/num -I /usr/home/opam/.opam/5.1.0/lib/parsexp -I /usr/home/opam/.opam/5.1.0/lib/ppx_assert/runtime-lib -I /usr/home/opam/.opam/5.1.0/lib/ppx_bench/runtime-lib -I /usr/home/opam/.opam/5.1.0/lib/ppx_compare/runtime-lib -I /usr/home/opam/.opam/5.1.0/lib/ppx_enumerate/runtime-lib -I /usr/home/opam/.opam/5.1.0/lib/ppx_expect/collector -I /usr/home/opam/.opam/5.1.0/lib/ppx_expect/common -I /usr/home/opam/.opam/5.1.0/lib/ppx_expect/config -I /usr/home/opam/.opam/5.1.0/lib/ppx_expect/config_types -I /usr/home/opam/.opam/5.1.0/lib/ppx_hash/runtime-lib -I /usr/home/opam/.opam/5.1.0/lib/ppx_here/runtime-lib -I /usr/home/opam/.opam/5.1.0/lib/ppx_inline_test/config -I /usr/home/opam/.opam/5.1.0/lib/ppx_inline_test/runtime-lib -I /usr/home/opam/.opam/5.1.0/lib/ppx_log/types -I /usr/home/opam/.opam/5.1.0/lib/ppx_module_timer/runtime -I /usr/home/opam/.opam/5.1.0/lib/ppx_sexp_conv/runtime-lib -I /usr/home/opam/.opam/5.1.0/lib/ppx_stable_witness/runtime -I /usr/home/opam/.opam/5.1.0/lib/ppx_stable_witness/stable_witness -I /usr/home/opam/.opam/5.1.0/lib/sexplib -I /usr/home/opam/.opam/5.1.0/lib/sexplib0 -I /usr/home/opam/.opam/5.1.0/lib/splittable_random -I /usr/home/opam/.opam/5.1.0/lib/stdio -I /usr/home/opam/.opam/5.1.0/lib/time_now -I /usr/home/opam/.opam/5.1.0/lib/typerep -I /usr/home/opam/.opam/5.1.0/lib/variantslib -I /usr/home/opam/.opam/5.1.0/lib/zarith -I /usr/home/opam/.opam/5.1.0/lib/zarith_stubs_js -I bigint/src/.bigint.objs/byte -no-alias-deps -open Bignum__ -o src/.bignum.objs/byte/bignum__Zarith.cmo -c -impl src/zarith.pp.ml)
- File "src/zarith.ml", line 4, characters 24-38:
- 4 | module Zarith_version = Zarith_version
- ^^^^^^^^^^^^^^
- Warning 49 [no-cmi-file]: no cmi file was found in path for module Zarith_version
- (cd _build/default && /usr/home/opam/.opam/5.1.0/bin/ocamlopt.opt -w -40 -g -I src/.bignum.objs/byte -I src/.bignum.objs/native -I /usr/home/opam/.opam/5.1.0/lib/base -I /usr/home/opam/.opam/5.1.0/lib/base/base_internalhash_types -I /usr/home/opam/.opam/5.1.0/lib/base/caml -I /usr/home/opam/.opam/5.1.0/lib/base/md5 -I /usr/home/opam/.opam/5.1.0/lib/base/shadow_stdlib -I /usr/home/opam/.opam/5.1.0/lib/base_bigstring -I /usr/home/opam/.opam/5.1.0/lib/base_quickcheck -I /usr/home/opam/.opam/5.1.0/lib/base_quickcheck/ppx_quickcheck/runtime -I /usr/home/opam/.opam/5.1.0/lib/bin_prot -I /usr/home/opam/.opam/5.1.0/lib/bin_prot/shape -I /usr/home/opam/.opam/5.1.0/lib/core -I /usr/home/opam/.opam/5.1.0/lib/core/base_for_tests -I /usr/home/opam/.opam/5.1.0/lib/core/command -I /usr/home/opam/.opam/5.1.0/lib/core/filename_base -I /usr/home/opam/.opam/5.1.0/lib/core/heap_block -I /usr/home/opam/.opam/5.1.0/lib/core/univ_map -I /usr/home/opam/.opam/5.1.0/lib/core/validate -I /usr/home/opam/.opam/5.1.0/lib/fieldslib -I /usr/home/opam/.opam/5.1.0/lib/int_repr -I /usr/home/opam/.opam/5.1.0/lib/jane-street-headers -I /usr/home/opam/.opam/5.1.0/lib/num -I /usr/home/opam/.opam/5.1.0/lib/parsexp -I /usr/home/opam/.opam/5.1.0/lib/ppx_assert/runtime-lib -I /usr/home/opam/.opam/5.1.0/lib/ppx_bench/runtime-lib -I /usr/home/opam/.opam/5.1.0/lib/ppx_compare/runtime-lib -I /usr/home/opam/.opam/5.1.0/lib/ppx_enumerate/runtime-lib -I /usr/home/opam/.opam/5.1.0/lib/ppx_expect/collector -I /usr/home/opam/.opam/5.1.0/lib/ppx_expect/common -I /usr/home/opam/.opam/5.1.0/lib/ppx_expect/config -I /usr/home/opam/.opam/5.1.0/lib/ppx_expect/config_types -I /usr/home/opam/.opam/5.1.0/lib/ppx_hash/runtime-lib -I /usr/home/opam/.opam/5.1.0/lib/ppx_here/runtime-lib -I /usr/home/opam/.opam/5.1.0/lib/ppx_inline_test/config -I /usr/home/opam/.opam/5.1.0/lib/ppx_inline_test/runtime-lib -I /usr/home/opam/.opam/5.1.0/lib/ppx_log/types -I /usr/home/opam/.opam/5.1.0/lib/ppx_module_timer/runtime -I /usr/home/opam/.opam/5.1.0/lib/ppx_sexp_conv/runtime-lib -I /usr/home/opam/.opam/5.1.0/lib/ppx_stable_witness/runtime -I /usr/home/opam/.opam/5.1.0/lib/ppx_stable_witness/stable_witness -I /usr/home/opam/.opam/5.1.0/lib/sexplib -I /usr/home/opam/.opam/5.1.0/lib/sexplib0 -I /usr/home/opam/.opam/5.1.0/lib/splittable_random -I /usr/home/opam/.opam/5.1.0/lib/stdio -I /usr/home/opam/.opam/5.1.0/lib/time_now -I /usr/home/opam/.opam/5.1.0/lib/typerep -I /usr/home/opam/.opam/5.1.0/lib/variantslib -I /usr/home/opam/.opam/5.1.0/lib/zarith -I /usr/home/opam/.opam/5.1.0/lib/zarith_stubs_js -I bigint/src/.bigint.objs/byte -I bigint/src/.bigint.objs/native -intf-suffix .ml -no-alias-deps -open Bignum__ -o src/.bignum.objs/native/bignum__Zarith.cmx -c -impl src/zarith.pp.ml)
- File "src/zarith.ml", line 4, characters 24-38:
- 4 | module Zarith_version = Zarith_version
- ^^^^^^^^^^^^^^
- Warning 49 [no-cmi-file]: no cmi file was found in path for module Zarith_version
-> compiled bignum.v0.16.0
Processing 200/204: [core_kernel: dune build]
-> installed bignum.v0.16.0
Processing 201/204: [core_kernel: dune build]
+ /usr/home/opam/.opam/5.1.0/bin/dune "build" "-p" "core_kernel" "-j" "15" (CWD=/usr/home/opam/.opam/5.1.0/.opam-switch/build/core_kernel.v0.16.0)
-> compiled core_kernel.v0.16.0
-> installed core_kernel.v0.16.0
Processing 203/204: [randoml: dune build]
+ /usr/home/opam/.opam/5.1.0/bin/dune "build" "-p" "randoml" "-j" "15" "@install" (CWD=/usr/home/opam/.opam/5.1.0/.opam-switch/build/randoml.0.1.5)
- (cd _build/default && /usr/home/opam/.opam/5.1.0/bin/ocamlc.opt -w -40 -g -bin-annot -I lib/.randoml.objs/byte -I /usr/home/opam/.opam/5.1.0/lib/base -I /usr/home/opam/.opam/5.1.0/lib/base/base_internalhash_types -I /usr/home/opam/.opam/5.1.0/lib/base/caml -I /usr/home/opam/.opam/5.1.0/lib/base/md5 -I /usr/home/opam/.opam/5.1.0/lib/base/shadow_stdlib -I /usr/home/opam/.opam/5.1.0/lib/base_bigstring -I /usr/home/opam/.opam/5.1.0/lib/base_quickcheck -I /usr/home/opam/.opam/5.1.0/lib/base_quickcheck/ppx_quickcheck/runtime -I /usr/home/opam/.opam/5.1.0/lib/bignum/bigint -I /usr/home/opam/.opam/5.1.0/lib/bin_prot -I /usr/home/opam/.opam/5.1.0/lib/bin_prot/shape -I /usr/home/opam/.opam/5.1.0/lib/core -I /usr/home/opam/.opam/5.1.0/lib/core/base_for_tests -I /usr/home/opam/.opam/5.1.0/lib/core/command -I /usr/home/opam/.opam/5.1.0/lib/core/filename_base -I /usr/home/opam/.opam/5.1.0/lib/core/heap_block -I /usr/home/opam/.opam/5.1.0/lib/core/univ_map -I /usr/home/opam/.opam/5.1.0/lib/core/validate -I /usr/home/opam/.opam/5.1.0/lib/core_kernel -I /usr/home/opam/.opam/5.1.0/lib/fieldslib -I /usr/home/opam/.opam/5.1.0/lib/int_repr -I /usr/home/opam/.opam/5.1.0/lib/jane-street-headers -I /usr/home/opam/.opam/5.1.0/lib/num -I /usr/home/opam/.opam/5.1.0/lib/parsexp -I /usr/home/opam/.opam/5.1.0/lib/ppx_assert/runtime-lib -I /usr/home/opam/.opam/5.1.0/lib/ppx_bench/runtime-lib -I /usr/home/opam/.opam/5.1.0/lib/ppx_compare/runtime-lib -I /usr/home/opam/.opam/5.1.0/lib/ppx_enumerate/runtime-lib -I /usr/home/opam/.opam/5.1.0/lib/ppx_expect/collector -I /usr/home/opam/.opam/5.1.0/lib/ppx_expect/common -I /usr/home/opam/.opam/5.1.0/lib/ppx_expect/config -I /usr/home/opam/.opam/5.1.0/lib/ppx_expect/config_types -I /usr/home/opam/.opam/5.1.0/lib/ppx_hash/runtime-lib -I /usr/home/opam/.opam/5.1.0/lib/ppx_here/runtime-lib -I /usr/home/opam/.opam/5.1.0/lib/ppx_inline_test/config -I /usr/home/opam/.opam/5.1.0/lib/ppx_inline_test/runtime-lib -I /usr/home/opam/.opam/5.1.0/lib/ppx_log/types -I /usr/home/opam/.opam/5.1.0/lib/ppx_module_timer/runtime -I /usr/home/opam/.opam/5.1.0/lib/ppx_sexp_conv/runtime-lib -I /usr/home/opam/.opam/5.1.0/lib/ppx_stable_witness/runtime -I /usr/home/opam/.opam/5.1.0/lib/ppx_stable_witness/stable_witness -I /usr/home/opam/.opam/5.1.0/lib/sexplib -I /usr/home/opam/.opam/5.1.0/lib/sexplib0 -I /usr/home/opam/.opam/5.1.0/lib/splittable_random -I /usr/home/opam/.opam/5.1.0/lib/stdio -I /usr/home/opam/.opam/5.1.0/lib/time_now -I /usr/home/opam/.opam/5.1.0/lib/typerep -I /usr/home/opam/.opam/5.1.0/lib/variantslib -I /usr/home/opam/.opam/5.1.0/lib/zarith -I /usr/home/opam/.opam/5.1.0/lib/zarith_stubs_js -I lib/rand/.rand.objs/byte -intf-suffix .ml -no-alias-deps -o lib/.randoml.objs/byte/randoml.cmo -c -impl lib/randoml.pp.ml)
- File "lib/randoml.ml", line 1, characters 5-16:
- 1 | open Core_kernel
- ^^^^^^^^^^^
- Alert deprecated: module Core_kernel
- [since 2021-05] Use [Core] -- [Core_kernel] was renamed as [Core]
- (cd _build/default && /usr/home/opam/.opam/5.1.0/bin/ocamlopt.opt -w -40 -g -I lib/.randoml.objs/byte -I lib/.randoml.objs/native -I /usr/home/opam/.opam/5.1.0/lib/base -I /usr/home/opam/.opam/5.1.0/lib/base/base_internalhash_types -I /usr/home/opam/.opam/5.1.0/lib/base/caml -I /usr/home/opam/.opam/5.1.0/lib/base/md5 -I /usr/home/opam/.opam/5.1.0/lib/base/shadow_stdlib -I /usr/home/opam/.opam/5.1.0/lib/base_bigstring -I /usr/home/opam/.opam/5.1.0/lib/base_quickcheck -I /usr/home/opam/.opam/5.1.0/lib/base_quickcheck/ppx_quickcheck/runtime -I /usr/home/opam/.opam/5.1.0/lib/bignum/bigint -I /usr/home/opam/.opam/5.1.0/lib/bin_prot -I /usr/home/opam/.opam/5.1.0/lib/bin_prot/shape -I /usr/home/opam/.opam/5.1.0/lib/core -I /usr/home/opam/.opam/5.1.0/lib/core/base_for_tests -I /usr/home/opam/.opam/5.1.0/lib/core/command -I /usr/home/opam/.opam/5.1.0/lib/core/filename_base -I /usr/home/opam/.opam/5.1.0/lib/core/heap_block -I /usr/home/opam/.opam/5.1.0/lib/core/univ_map -I /usr/home/opam/.opam/5.1.0/lib/core/validate -I /usr/home/opam/.opam/5.1.0/lib/core_kernel -I /usr/home/opam/.opam/5.1.0/lib/fieldslib -I /usr/home/opam/.opam/5.1.0/lib/int_repr -I /usr/home/opam/.opam/5.1.0/lib/jane-street-headers -I /usr/home/opam/.opam/5.1.0/lib/num -I /usr/home/opam/.opam/5.1.0/lib/parsexp -I /usr/home/opam/.opam/5.1.0/lib/ppx_assert/runtime-lib -I /usr/home/opam/.opam/5.1.0/lib/ppx_bench/runtime-lib -I /usr/home/opam/.opam/5.1.0/lib/ppx_compare/runtime-lib -I /usr/home/opam/.opam/5.1.0/lib/ppx_enumerate/runtime-lib -I /usr/home/opam/.opam/5.1.0/lib/ppx_expect/collector -I /usr/home/opam/.opam/5.1.0/lib/ppx_expect/common -I /usr/home/opam/.opam/5.1.0/lib/ppx_expect/config -I /usr/home/opam/.opam/5.1.0/lib/ppx_expect/config_types -I /usr/home/opam/.opam/5.1.0/lib/ppx_hash/runtime-lib -I /usr/home/opam/.opam/5.1.0/lib/ppx_here/runtime-lib -I /usr/home/opam/.opam/5.1.0/lib/ppx_inline_test/config -I /usr/home/opam/.opam/5.1.0/lib/ppx_inline_test/runtime-lib -I /usr/home/opam/.opam/5.1.0/lib/ppx_log/types -I /usr/home/opam/.opam/5.1.0/lib/ppx_module_timer/runtime -I /usr/home/opam/.opam/5.1.0/lib/ppx_sexp_conv/runtime-lib -I /usr/home/opam/.opam/5.1.0/lib/ppx_stable_witness/runtime -I /usr/home/opam/.opam/5.1.0/lib/ppx_stable_witness/stable_witness -I /usr/home/opam/.opam/5.1.0/lib/sexplib -I /usr/home/opam/.opam/5.1.0/lib/sexplib0 -I /usr/home/opam/.opam/5.1.0/lib/splittable_random -I /usr/home/opam/.opam/5.1.0/lib/stdio -I /usr/home/opam/.opam/5.1.0/lib/time_now -I /usr/home/opam/.opam/5.1.0/lib/typerep -I /usr/home/opam/.opam/5.1.0/lib/variantslib -I /usr/home/opam/.opam/5.1.0/lib/zarith -I /usr/home/opam/.opam/5.1.0/lib/zarith_stubs_js -I lib/rand/.rand.objs/byte -I lib/rand/.rand.objs/native -intf-suffix .ml -no-alias-deps -o lib/.randoml.objs/native/randoml.cmx -c -impl lib/randoml.pp.ml)
- File "lib/randoml.ml", line 1, characters 5-16:
- 1 | open Core_kernel
- ^^^^^^^^^^^
- Alert deprecated: module Core_kernel
- [since 2021-05] Use [Core] -- [Core_kernel] was renamed as [Core]
- File "lib/rand/dune", line 7, characters 0-671:
- 7 | (rule
- 8 | (targets librand.a dllrand.so)
- 9 | (deps
- ....
- 24 | -c
- 25 | "mv target/release/librand.so ./dllrand.so 2> /dev/null || mv target/release/librand.dylib ./dllrand.so 2> /dev/null || touch dllrand.so")
- 26 | (run cp target/release/librand.a .))))
- (cd _build/default/lib/rand && /usr/local/bin/cargo build --release --offline)
- Compiling proc-macro2 v1.0.27
- Compiling unicode-xid v0.2.2
- Compiling libc v0.2.97
- Compiling cc v1.0.68
- Compiling syn v1.0.73
- Compiling ocaml-sys v0.20.1
- Compiling cfg-if v1.0.0
- Compiling ocaml-sys v0.22.0
- Compiling cty v0.2.1
- Compiling chlorine v1.0.7
- Compiling ppv-lite86 v0.2.10
- Compiling static_assertions v1.1.0
- Compiling getrandom v0.2.3
- Compiling rand_core v0.6.3
- Compiling ocaml-boxroot-sys v0.2.0
- Compiling quote v1.0.9
- Compiling rand_chacha v0.3.1
- The following warnings were emitted during compilation:
-
- warning: vendor/boxroot/boxroot.c:360:31: warning: unused variable 'cl' [-Wunused-variable]
- warning: FOREACH_GLOBAL_RING(global, cl, {
- warning: ^
- warning: vendor/boxroot/boxroot.c:375:31: warning: unused variable 'cl' [-Wunused-variable]
- warning: FOREACH_GLOBAL_RING(global, cl, { *global = NULL; });
- warning: ^
- warning: vendor/boxroot/boxroot.c:521:17: warning: comparison of integers of different signs: 'int' and 'unsigned long' [-Wsign-compare]
- warning: if (threshold <= LOW_COUNT_THRESHOLD) return LOW;
- warning: ~~~~~~~~~ ^ ~~~~~~~~~~~~~~~~~~~
- warning: vendor/boxroot/boxroot.c:522:17: warning: comparison of integers of different signs: 'int' and 'unsigned long' [-Wsign-compare]
- warning: if (threshold <= HIGH_COUNT_THRESHOLD) return HIGH;
- warning: ~~~~~~~~~ ^ ~~~~~~~~~~~~~~~~~~~~
- warning: vendor/boxroot/boxroot.c:544:11: warning: enumeration value 'NO_CHANGE' not handled in switch [-Wswitch]
- warning: switch (occ) {
- warning: ^~~
- warning: vendor/boxroot/boxroot.c:821:33: error: too few arguments to function call, expected 3, have 2
- warning: action(v, (value *)current);
- warning: ~~~~~~ ^
- warning: vendor/boxroot/boxroot.c:854:59: warning: too many arguments in call to 'try_free_chunks'
- warning: stats.total_freed_chunks += try_free_chunks(pools.free);
- warning: ~~~~~~~~~~~~~~~ ^
- warning: vendor/boxroot/boxroot.c:1043:31: warning: unused variable 'cl' [-Wunused-variable]
- warning: FOREACH_GLOBAL_RING(global, cl, { *global = NULL; });
- warning: ^
- warning: vendor/boxroot/boxroot.c:1045:24: warning: incompatible function pointer types assigning to 'void (*)(scanning_action)' (aka 'void (*)(void (*)(void *, long, volatile long *))') from '_Atomic(scan_roots_hook)' [-Wincompatible-function-pointer-types]
- warning: prev_scan_roots_hook = caml_scan_roots_hook;
- warning: ^ ~~~~~~~~~~~~~~~~~~~~
- warning: vendor/boxroot/boxroot.c:1049:24: warning: incompatible function pointer types assigning to '_Atomic(scan_roots_hook)' from 'void (scanning_action)' (aka 'void (void (*)(void *, long, volatile long *))') [-Wincompatible-function-pointer-types]
- warning: caml_scan_roots_hook = scanning_callback;
- warning: ^ ~~~~~~~~~~~~~~~~~
- warning: vendor/boxroot/boxroot.c:1061:24: warning: incompatible function pointer types assigning to '_Atomic(scan_roots_hook)' from 'void (*)(scanning_action)' (aka 'void (*)(void (*)(void *, long, volatile long *))') [-Wincompatible-function-pointer-types]
- warning: caml_scan_roots_hook = prev_scan_roots_hook;
- warning: ^ ~~~~~~~~~~~~~~~~~~~~
- warning: 10 warnings and 1 error generated.
-
- error: failed to run custom build command for `ocaml-boxroot-sys v0.2.0`
-
- Caused by:
- process didn't exit successfully: `/usr/home/opam/.opam/5.1.0/.opam-switch/build/randoml.0.1.5/_build/default/lib/rand/target/release/build/ocaml-boxroot-sys-5ab725f4534b2846/build-script-build` (exit status: 1)
- --- stdout
- cargo:rerun-if-changed=vendor/boxroot/boxroot.c
- cargo:rerun-if-changed=vendor/boxroot/boxroot.h
- cargo:rerun-if-env-changed=OCAMLOPT
- cargo:rerun-if-env-changed=OCAML_WHERE_PATH
- TARGET = Some("x86_64-unknown-freebsd")
- OPT_LEVEL = Some("3")
- HOST = Some("x86_64-unknown-freebsd")
- CC_x86_64-unknown-freebsd = None
- CC_x86_64_unknown_freebsd = None
- HOST_CC = None
- CC = None
- CFLAGS_x86_64-unknown-freebsd = None
- CFLAGS_x86_64_unknown_freebsd = None
- HOST_CFLAGS = None
- CFLAGS = None
- CRATE_CC_NO_DEFAULTS = None
- DEBUG = Some("false")
- CARGO_CFG_TARGET_FEATURE = Some("fxsr,sse,sse2")
- running: "cc" "-O3" "-ffunction-sections" "-fdata-sections" "-fPIC" "-m64" "-I" "/usr/home/opam/.opam/5.1.0/lib/ocaml" "-I" "vendor/boxroot/" "-Wall" "-Wextra" "-o" "/usr/home/opam/.opam/5.1.0/.opam-switch/build/randoml.0.1.5/_build/default/lib/rand/target/release/build/ocaml-boxroot-sys-fac4f805e2de7fc0/out/vendor/boxroot/boxroot.o" "-c" "vendor/boxroot/boxroot.c"
- cargo:warning=vendor/boxroot/boxroot.c:360:31: warning: unused variable 'cl' [-Wunused-variable]
- cargo:warning= FOREACH_GLOBAL_RING(global, cl, {
- cargo:warning= ^
- cargo:warning=vendor/boxroot/boxroot.c:375:31: warning: unused variable 'cl' [-Wunused-variable]
- cargo:warning= FOREACH_GLOBAL_RING(global, cl, { *global = NULL; });
- cargo:warning= ^
- cargo:warning=vendor/boxroot/boxroot.c:521:17: warning: comparison of integers of different signs: 'int' and 'unsigned long' [-Wsign-compare]
- cargo:warning= if (threshold <= LOW_COUNT_THRESHOLD) return LOW;
- cargo:warning= ~~~~~~~~~ ^ ~~~~~~~~~~~~~~~~~~~
- cargo:warning=vendor/boxroot/boxroot.c:522:17: warning: comparison of integers of different signs: 'int' and 'unsigned long' [-Wsign-compare]
- cargo:warning= if (threshold <= HIGH_COUNT_THRESHOLD) return HIGH;
- cargo:warning= ~~~~~~~~~ ^ ~~~~~~~~~~~~~~~~~~~~
- cargo:warning=vendor/boxroot/boxroot.c:544:11: warning: enumeration value 'NO_CHANGE' not handled in switch [-Wswitch]
- cargo:warning= switch (occ) {
- cargo:warning= ^~~
- cargo:warning=vendor/boxroot/boxroot.c:821:33: error: too few arguments to function call, expected 3, have 2
- cargo:warning= action(v, (value *)current);
- cargo:warning= ~~~~~~ ^
- cargo:warning=vendor/boxroot/boxroot.c:854:59: warning: too many arguments in call to 'try_free_chunks'
- cargo:warning= stats.total_freed_chunks += try_free_chunks(pools.free);
- cargo:warning= ~~~~~~~~~~~~~~~ ^
- cargo:warning=vendor/boxroot/boxroot.c:1043:31: warning: unused variable 'cl' [-Wunused-variable]
- cargo:warning= FOREACH_GLOBAL_RING(global, cl, { *global = NULL; });
- cargo:warning= ^
- cargo:warning=vendor/boxroot/boxroot.c:1045:24: warning: incompatible function pointer types assigning to 'void (*)(scanning_action)' (aka 'void (*)(void (*)(void *, long, volatile long *))') from '_Atomic(scan_roots_hook)' [-Wincompatible-function-pointer-types]
- cargo:warning= prev_scan_roots_hook = caml_scan_roots_hook;
- cargo:warning= ^ ~~~~~~~~~~~~~~~~~~~~
- cargo:warning=vendor/boxroot/boxroot.c:1049:24: warning: incompatible function pointer types assigning to '_Atomic(scan_roots_hook)' from 'void (scanning_action)' (aka 'void (void (*)(void *, long, volatile long *))') [-Wincompatible-function-pointer-types]
- cargo:warning= caml_scan_roots_hook = scanning_callback;
- cargo:warning= ^ ~~~~~~~~~~~~~~~~~
- cargo:warning=vendor/boxroot/boxroot.c:1061:24: warning: incompatible function pointer types assigning to '_Atomic(scan_roots_hook)' from 'void (*)(scanning_action)' (aka 'void (*)(void (*)(void *, long, volatile long *))') [-Wincompatible-function-pointer-types]
- cargo:warning= caml_scan_roots_hook = prev_scan_roots_hook;
- cargo:warning= ^ ~~~~~~~~~~~~~~~~~~~~
- cargo:warning=10 warnings and 1 error generated.
- exit status: 1
-
- --- stderr
-
-
- error occurred: Command "cc" "-O3" "-ffunction-sections" "-fdata-sections" "-fPIC" "-m64" "-I" "/usr/home/opam/.opam/5.1.0/lib/ocaml" "-I" "vendor/boxroot/" "-Wall" "-Wextra" "-o" "/usr/home/opam/.opam/5.1.0/.opam-switch/build/randoml.0.1.5/_build/default/lib/rand/target/release/build/ocaml-boxroot-sys-fac4f805e2de7fc0/out/vendor/boxroot/boxroot.o" "-c" "vendor/boxroot/boxroot.c" with args "cc" did not execute successfully (status code exit status: 1).
-
-
- warning: build failed, waiting for other jobs to finish...
[ERROR] The compilation of randoml.0.1.5 failed at "dune build -p randoml -j 15 @install".
#=== ERROR while compiling randoml.0.1.5 ======================================#
# context 2.1.5 | freebsd/x86_64 | ocaml-base-compiler.5.1.0 | file:///usr/home/opam/opam-repository
# path /usr/home/opam/.opam/5.1.0/.opam-switch/build/randoml.0.1.5
# command /usr/home/opam/.opam/5.1.0/bin/dune build -p randoml -j 15 @install
# exit-code 1
# env-file /usr/home/opam/.opam/log/randoml-48857-33b6cc.env
# output-file /usr/home/opam/.opam/log/randoml-48857-33b6cc.out
### output ###
# Caused by:
# [...]
# cargo:warning= ^ ~~~~~~~~~~~~~~~~~~~~
# cargo:warning=10 warnings and 1 error generated.
# exit status: 1
#
# --- stderr
#
#
# error occurred: Command "cc" "-O3" "-ffunction-sections" "-fdata-sections" "-fPIC" "-m64" "-I" "/usr/home/opam/.opam/5.1.0/lib/ocaml" "-I" "vendor/boxroot/" "-Wall" "-Wextra" "-o" "/usr/home/opam/.opam/5.1.0/.opam-switch/build/randoml.0.1.5/_build/default/lib/rand/target/release/build/ocaml-boxroot-sys-fac4f805e2de7fc0/out/vendor/boxroot/boxroot.o" "-c" "vendor/boxroot/boxroot.c" with args [...]
#
#
# warning: build failed, waiting for other jobs to finish...
<><> Error report <><><><><><><><><><><><><><><><><><><><><><><><><><><><><><><>
+- The following actions failed
| - build randoml 0.1.5
+-
+- The following changes have been performed
| - install base v0.16.3
| - install base_bigstring v0.16.0
| - install base_quickcheck v0.16.0
| - install bignum v0.16.0
| - install bin_prot v0.16.0
| - install conf-gmp 4
| - install conf-rust-2018 1
| - install core v0.16.2
| - install core_kernel v0.16.0
| - install csexp 1.5.2
| - install dune 3.11.1
| - install dune-configurator 3.11.1
| - install fieldslib v0.16.0
| - install int_repr v0.16.0
| - install jane-street-headers v0.16.0
| - install jst-config v0.16.0
| - install num 1.4
| - install ocaml-compiler-libs v0.12.4
| - install ocamlfind 1.9.6
| - install parsexp v0.16.0
| - install ppx_assert v0.16.0
| - install ppx_base v0.16.0
| - install ppx_bench v0.16.0
| - install ppx_bin_prot v0.16.0
| - install ppx_cold v0.16.0
| - install ppx_compare v0.16.0
| - install ppx_custom_printf v0.16.0
| - install ppx_derivers 1.2.1
| - install ppx_disable_unused_warnings v0.16.0
| - install ppx_enumerate v0.16.0
| - install ppx_expect v0.16.0
| - install ppx_fields_conv v0.16.0
| - install ppx_fixed_literal v0.16.0
| - install ppx_globalize v0.16.0
| - install ppx_hash v0.16.0
| - install ppx_here v0.16.0
| - install ppx_ignore_instrumentation v0.16.0
| - install ppx_inline_test v0.16.1
| - install ppx_jane v0.16.0
| - install ppx_let v0.16.0
| - install ppx_log v0.16.0
| - install ppx_module_timer v0.16.0
| - install ppx_optcomp v0.16.0
| - install ppx_optional v0.16.0
| - install ppx_pipebang v0.16.0
| - install ppx_sexp_conv v0.16.0
| - install ppx_sexp_message v0.16.0
| - install ppx_sexp_value v0.16.0
| - install ppx_stable v0.16.0
| - install ppx_stable_witness v0.16.0
| - install ppx_string v0.16.0
| - install ppx_tydi v0.16.0
| - install ppx_typerep_conv v0.16.0
| - install ppx_variants_conv v0.16.0
| - install ppxlib 0.31.0
| - install re 1.11.0
| - install seq base
| - install sexplib v0.16.0
| - install sexplib0 v0.16.0
| - install splittable_random v0.16.0
| - install stdio v0.16.0
| - install stdlib-shims 0.3.0
| - install time_now v0.16.0
| - install typerep v0.16.0
| - install variantslib v0.16.0
| - install zarith 1.13
| - install zarith_stubs_js v0.16.0
+-
The former state can be restored with:
/usr/local/bin/opam switch import "/usr/home/opam/.opam/5.1.0/.opam-switch/backup/state-20231101163139.export"
'opam install -vy randoml.0.1.5' failed.
jail: /usr/bin/su -l opam -c cd '/' && env OPAMCRITERIA='+removed' OPAMEXTERNALSOLVER='builtin-0install' OPAMUTF8='never' OPAMPRECISETRACKING='1' '/usr/bin/env' 'bash' '-c' '
opam remove -y "randoml.0.1.5"
opam install -vy "randoml.0.1.5"
res=$?
if [ $res = 31 ]; then
if opam show -f x-ci-accept-failures: "randoml.0.1.5" | grep -q '\''"freebsd"'\''; then
echo "This package failed and has been disabled for CI using the '\''x-ci-accept-failures'\'' field."
exit 69
fi
fi
exit $res
': failed
"jail" "-c" "name=obuilder_90869_10095" "mount.fstab=/tmp/obuilder-jail-32ecd5/fstab" "mount.devfs" "path=/obuilder/result/9ff31b836509a8088c54c6f3f064d2e24e7206eafa197062b50e26d38fc69183/rootfs" "host=inherit" "ip6=inherit" "ip4=inherit" "command=/usr/bin/su" "-l" "opam" "-c" "cd '/' && env OPAMCRITERIA='+removed' OPAMEXTERNALSOLVER='builtin-0install' OPAMUTF8='never' OPAMPRECISETRACKING='1' '/usr/bin/env' 'bash' '-c' '
opam remove -y "randoml.0.1.5"
opam install -vy "randoml.0.1.5"
res=$?
if [ $res = 31 ]; then
if opam show -f x-ci-accept-failures: "randoml.0.1.5" | grep -q '\''"freebsd"'\''; then
echo "This package failed and has been disabled for CI using the '\''x-ci-accept-failures'\'' field."
exit 69
fi
fi
exit $res
'" failed with exit status 1
Failed: Build failed