OCamllabs icon Home|Differences with the last checks|Previous runs


Building on summer

(from freebsd-ocaml-5.0)
2023-10-18 01:54.08 ---> using "b0ee167c73857b60ecf6c06eff6bbe96857a02ac84fefd2b9807cb2eea16bf97" from cache

/: (user (uid 1000) (gid 1000))

/: (env OPAMPRECISETRACKING 1)

/: (env OPAMUTF8 never)

/: (env OPAMEXTERNALSOLVER builtin-0install)

/: (env OPAMCRITERIA +removed)

/: (run (shell "sudo ln -f /usr/local/bin/opam-2.1 /usr/local/bin/opam"))
2023-10-18 01:54.09 ---> using "58da31f76f3dd28576bb2b11a05c1473a2cbc0bc8e959f83414ab7001888e94f" from cache

/: (run (network host)
        (shell "rm -rf ~/opam-repository && git clone -q 'https://github.com/ocaml/opam-repository' ~/opam-repository && git -C ~/opam-repository checkout -q a4349cb398e7d693e3d509914067dc47d1c71782"))
2023-10-18 01:54.09 ---> using "847cbd71d6e243cb26730c6185d78510731de6bc2b4440eaf8f09e2ada29204e" from cache

/: (run (shell "rm -rf ~/.opam && opam init -ya --bare  ~/opam-repository"))
No configuration file found, using built-in defaults.
Checking for available remotes: rsync and local, git.
  - you won't be able to use mercurial repositories unless you install the hg command on your system.
  - you won't be able to use darcs repositories unless you install the darcs command on your system.


<><> Fetching repository information ><><><><><><><><><><><><><><><><><><><><><>
[default] Initialised

User configuration:
  /usr/home/opam/.profile is already up-to-date.
[NOTE] Make sure that /usr/home/opam/.profile is well sourced in your ~/.bashrc.

2023-10-18 01:54.09 ---> using "76fe4e508bf18ac6169aa42d066ca9a1236d6528de4350d6a7fa0ee89b29da2f" from cache

/: (run (cache (opam-archives (target /usr/home/opam/.opam/download-cache)))
        (network host)
        (shell "opam switch create --repositories=default '5.1.0' 'ocaml-base-compiler.5.1.0'"))

<><> Installing new switch packages <><><><><><><><><><><><><><><><><><><><><><>
Switch invariant: ["ocaml-base-compiler" {= "5.1.0"}]

<><> Processing actions <><><><><><><><><><><><><><><><><><><><><><><><><><><><>
-> installed base-bigarray.base
-> installed base-threads.base
-> installed base-unix.base
-> installed ocaml-options-vanilla.1
-> retrieved ocaml-base-compiler.5.1.0  (https://github.com/ocaml/ocaml/archive/5.1.0.tar.gz)
-> installed ocaml-base-compiler.5.1.0
-> installed ocaml-config.3
-> installed ocaml.5.1.0
-> installed base-domains.base
-> installed base-nnp.base
Done.
# Run eval $(opam env --switch=5.1.0) to update the current shell environment
2023-10-18 01:54.09 ---> using "45001699be8995f4b15be626c3924c9cad054345a4e372d9e7d67e717e7c9603" from cache

/: (run (network host)
        (shell "opam update --depexts"))
[WARNING] Unknown update command for bsd, skipping system update
2023-10-18 01:54.09 ---> using "46c9f3ab7d5746063c1ef6a70a58a8d70b9b45d47abb0a64ca248a2dcd32acaa" from cache

/: (run (cache (opam-archives (target /usr/home/opam/.opam/download-cache)))
        (network host)
        (shell  "\
               \nopam remove -y \"conf-rocksdb.1\"\
               \nopam install -vy \"conf-rocksdb.1\"\
               \nres=$?\
               \nif [ $res = 31 ]; then\
               \n    if opam show -f x-ci-accept-failures: \"conf-rocksdb.1\" | grep -q '\"freebsd\"'; then\
               \n        echo \"This package failed and has been disabled for CI using the 'x-ci-accept-failures' field.\"\
               \n        exit 69\
               \n    fi\
               \nfi\
               \n\
               \n\
               \nexit $res\
               \n"))
[NOTE] conf-rocksdb.1 is not installed.

Nothing to do.
The following actions will be performed:
  - install conf-rocksdb 1

<><> Processing actions <><><><><><><><><><><><><><><><><><><><><><><><><><><><>
Processing  2/3: [conf-rocksdb: cc main.c]
+ /usr/bin/cc "-lrocksdb" "main.c" (CWD=/usr/home/opam/.opam/5.1.0/.opam-switch/build/conf-rocksdb.1)
- ld: error: unable to find library -lrocksdb
- cc: error: linker command failed with exit code 1 (use -v to see invocation)
[ERROR] The compilation of conf-rocksdb.1 failed at "cc -lrocksdb main.c".

#=== ERROR while compiling conf-rocksdb.1 =====================================#
# context              2.1.5 | freebsd/x86_64 | ocaml-base-compiler.5.1.0 | file:///usr/home/opam/opam-repository
# path                 /usr/home/opam/.opam/5.1.0/.opam-switch/build/conf-rocksdb.1
# command              /usr/bin/cc -lrocksdb main.c
# exit-code            1
# env-file             /usr/home/opam/.opam/log/conf-rocksdb-21836-c434bb.env
# output-file          /usr/home/opam/.opam/log/conf-rocksdb-21836-c434bb.out
### output ###
# ld: error: unable to find library -lrocksdb
# cc: error: linker command failed with exit code 1 (use -v to see invocation)



<><> Error report <><><><><><><><><><><><><><><><><><><><><><><><><><><><><><><>
+- The following actions failed
| - build conf-rocksdb 1
+- 
- No changes have been performed
'opam install -vy conf-rocksdb.1' failed.
jail: /usr/bin/su -l opam -c cd '/' && env OPAMCRITERIA='+removed' OPAMEXTERNALSOLVER='builtin-0install' OPAMUTF8='never' OPAMPRECISETRACKING='1' '/usr/bin/env' 'bash' '-c' '
opam remove -y "conf-rocksdb.1"
opam install -vy "conf-rocksdb.1"
res=$?
if [ $res = 31 ]; then
    if opam show -f x-ci-accept-failures: "conf-rocksdb.1" | grep -q '\''"freebsd"'\''; then
        echo "This package failed and has been disabled for CI using the '\''x-ci-accept-failures'\'' field."
        exit 69
    fi
fi


exit $res
': failed
"jail" "-c" "name=obuilder_86617_22538" "mount.fstab=/tmp/obuilder-jail-b281a7/fstab" "mount.devfs" "path=/obuilder/result/7754a0546bdfeace2a73f30698a0e235f74549f29bd6f82afafea46eb6a48e57/rootfs" "host=inherit" "ip6=inherit" "ip4=inherit" "command=/usr/bin/su" "-l" "opam" "-c" "cd '/' && env OPAMCRITERIA='+removed' OPAMEXTERNALSOLVER='builtin-0install' OPAMUTF8='never' OPAMPRECISETRACKING='1' '/usr/bin/env' 'bash' '-c' '
opam remove -y "conf-rocksdb.1"
opam install -vy "conf-rocksdb.1"
res=$?
if [ $res = 31 ]; then
    if opam show -f x-ci-accept-failures: "conf-rocksdb.1" | grep -q '\''"freebsd"'\''; then
        echo "This package failed and has been disabled for CI using the '\''x-ci-accept-failures'\'' field."
        exit 69
    fi
fi


exit $res
'" failed with exit status 1
Failed: Build failed